program: Orca
programVersion: 5.0.2
elementType: O O C C C C C C C C C C C C C C C C C C H H H H H H H H H H H H H H H H H H H H H H H H H H
charge: 0
multiplicity: 1
keywords: wb97x-d3
keywords: def2-TZVPP
keywords: def2/J RIJCOSX
keywords: DEFGRID2
keywords: scfconv7
keywords: smallprint printgap noloewdin
keywords: NOSOSCF
formula: C18H26O2
InChI: InChI=1/C18H26O2/c1-8-10-13(5)15(9-2)20-17(19)16-14(11-12(3)4)18(16,6)7/h2,10-11,14-16H,8H2,1,3-7H3
46 atoms
O  -0.675982 -1.002258 0.263851
O  -0.437503 0.018166 2.23799
C  2.220684 -1.961362 0.625512
C  2.16062 -0.766342 -0.26151
C  1.503048 -0.711989 1.112938
C  1.45798 -3.205512 0.238998
C  3.506005 -2.269727 1.356788
C  3.329961 0.09892 -0.553686
C  0.050861 -0.532457 1.278865
C  3.238259 1.352222 -1.00752
C  1.928389 2.042866 -1.242408
C  4.45729 2.157836 -1.334797
C  -2.086732 -0.719536 0.252272
C  -2.332894 0.650287 -0.337372
C  -2.700047 -1.779758 -0.541861
C  -1.927653 0.829788 -1.769829
C  -2.886665 1.583363 0.439155
C  -3.245445 2.985143 0.068367
C  -3.238583 -2.63708 -1.186722
C  -4.754435 3.211881 0.124026
H  1.448348 -0.853355 -1.077088
H  2.048725 -0.156243 1.867255
H  1.100278 -3.739321 1.121783
H  0.604169 -3.008996 -0.405014
H  2.121358 -3.88232 -0.30367
H  3.305249 -2.884262 2.236518
H  4.191236 -2.828201 0.715431
H  4.024793 -1.373371 1.69675
H  4.317335 -0.331609 -0.41365
H  1.089971 1.553402 -0.747956
H  1.964665 3.075874 -0.88905
H  1.698995 2.090485 -2.311107
H  5.378484 1.599442 -1.167493
H  4.445502 2.482282 -2.379081
H  4.499586 3.06835 -0.731131
H  -2.487782 -0.77097 1.268173
H  -1.823708 1.877955 -2.042732
H  -0.973224 0.345825 -1.983733
H  -2.662836 0.387013 -2.446556
H  -3.139236 1.30598 1.459981
H  -2.872305 3.246501 -0.922197
H  -2.760487 3.667516 0.773099
H  -3.713412 -3.400133 -1.762348
H  -5.154155 2.99121 1.115179
H  -5.000606 4.249055 -0.106942
H  -5.276305 2.577104 -0.59331
elementType: O C H
totalener: -852.00837515 hartree
nucrepener: 1580.31562076 hartree
electener: -2432.32399591 hartree
oneelecener: -4293.96588756 hartree
twoeener: 1861.64189166 hartree
cpcmener: -0.02132616 hartree
kineticenergy: 847.97234755 hartree
xcener: -85.213822746930 hartree
chargesum: 0.0000000
charge: -0.273564 -0.464678 0.149909 -0.012016 -0.104821 -0.267830 -0.296521 -0.305144 0.395260 0.000368 -0.241380 -0.227424 0.136416 -0.129833 -0.529125 -0.293559 -0.079599 -0.082923 0.206540 -0.266483 0.108850 0.088875 0.100284 0.088535 0.092885 0.098742 0.099910 0.091059 0.123803 0.062747 0.096014 0.106653 0.087760 0.094836 0.094827 0.119732 0.109719 0.100011 0.114998 0.118239 0.065973 0.075645 0.283559 0.086769 0.090573 0.085411
qa: -0.2736 -0.4647 0.1499 -0.0120 -0.1048 -0.2678 -0.2965 -0.3051 0.3953 0.0004 -0.2414 -0.2274 0.1364 -0.1298 -0.5291 -0.2936 -0.0796 -0.0829 0.2065 -0.2665 0.1088 0.0889 0.1003 0.0885 0.0929 0.0987 0.0999 0.0911 0.1238 0.0627 0.0960 0.1067 0.0878 0.0948 0.0948 0.1197 0.1097 0.1000 0.1150 0.1182 0.0660 0.0756 0.2836 0.0868 0.0906 0.0854
va: 2.1100 2.0450 3.7272 3.7945 3.8280 3.8918 3.9197 3.8687 4.1760 3.7018 3.9460 3.9311 3.9011 3.6989 3.9289 3.9454 3.8380 3.9172 3.4132 3.9151 1.0144 1.0299 1.0001 1.0106 1.0011 1.0022 0.9988 1.0017 1.0046 1.0104 1.0029 0.9960 1.0075 0.9947 0.9966 1.0255 1.0042 1.0025 0.9966 1.0136 1.0162 1.0047 0.9475 1.0022 1.0048 1.0024
dispcorr: -0.022227930 hartree
energy: -852.030603076309
dipole: 6.25010 -5.95108 0.29902 10.61400 -10.52367 0.09032 -7.40992 6.18927 -1.22065
magnitude: 1.25998 au
magnitude: 3.20262 debye
