program: Orca
programVersion: 5.0.2
elementType: O O C C C C C C C C C C C C C C C C C C H H H H H H H H H H H H H H H H H H H H H H H H H H
charge: 0
multiplicity: 1
keywords: wb97x-d3
keywords: def2-TZVPP
keywords: def2/J RIJCOSX
keywords: DEFGRID2
keywords: scfconv7
keywords: smallprint printgap noloewdin
keywords: NOSOSCF
formula: C18H26O2
InChI: InChI=1/C18H26O2/c1-8-10-13(5)15(9-2)20-17(19)16-14(11-12(3)4)18(16,6)7/h2,10-11,14-16H,8H2,1,3-7H3
46 atoms
O  -0.801232 -1.035888 -0.211914
O  -0.170613 0.301233 1.474736
C  1.677842 1.444128 -0.811774
C  2.473892 0.658388 0.17456
C  1.23884 0.035963 -0.43823
C  0.893217 2.641857 -0.333068
C  2.205834 1.602655 -2.217787
C  3.823899 0.127046 -0.147226
C  0.04145 -0.190211 0.397244
C  4.336864 -1.008877 0.327723
C  3.591872 -1.927633 1.24657
C  5.72392 -1.449104 -0.029431
C  -2.075943 -1.252601 0.410706
C  -3.045622 -0.181204 -0.033433
C  -2.508104 -2.591491 0.024769
C  -3.407895 -0.194364 -1.486584
C  -3.469922 0.698989 0.872617
C  -4.369794 1.873068 0.662704
C  -2.903615 -3.684265 -0.270134
C  -3.617491 3.189309 0.853589
H  2.33158 0.965339 1.208123
H  1.401608 -0.712177 -1.205802
H  1.518394 3.535031 -0.388409
H  0.018811 2.813779 -0.964244
H  0.550232 2.541194 0.693647
H  1.38672 1.791643 -2.913714
H  2.891945 2.450187 -2.279109
H  2.738466 0.718354 -2.567197
H  4.444641 0.737833 -0.797182
H  2.596801 -1.566306 1.496763
H  3.48825 -2.92091 0.802106
H  4.141323 -2.063915 2.181657
H  6.214124 -0.752319 -0.708544
H  6.34775 -1.543366 0.862998
H  5.712763 -2.432987 -0.505479
H  -1.966868 -1.220012 1.498465
H  -4.017815 0.660101 -1.770665
H  -2.512861 -0.184306 -2.111675
H  -3.962046 -1.099692 -1.743322
H  -3.09372 0.595287 1.886987
H  -5.190149 1.821715 1.384822
H  -4.834887 1.85232 -0.323362
H  -3.240682 -4.657328 -0.535631
H  -4.286007 4.044405 0.751791
H  -3.156778 3.242617 1.840702
H  -2.820632 3.292603 0.116671
totalener: -851.99506862 hartree
nucrepener: 1563.56838731 hartree
electener: -2415.56345592 hartree
oneelecener: -4260.08536278 hartree
twoeener: 1844.52190686 hartree
kineticenergy: 848.01017902 hartree
xcener: -85.216726086224 hartree
chargesum: -0.0000000
charge: -0.263300 -0.389460 0.133724 -0.024216 -0.120650 -0.262908 -0.277574 -0.237738 0.343445 -0.005298 -0.224784 -0.211170 0.109762 -0.152639 -0.453961 -0.254321 -0.021828 -0.106188 0.211549 -0.235199 0.106541 0.087209 0.086978 0.082458 0.102186 0.090133 0.090749 0.085947 0.092472 0.082254 0.086522 0.089295 0.078391 0.086854 0.084318 0.109472 0.084788 0.097865 0.103550 0.095482 0.071077 0.060514 0.244570 0.084815 0.082786 0.075528
qa: -0.2633 -0.3895 0.1337 -0.0242 -0.1206 -0.2629 -0.2776 -0.2377 0.3434 -0.0053 -0.2248 -0.2112 0.1098 -0.1526 -0.4540 -0.2543 -0.0218 -0.1062 0.2115 -0.2352 0.1065 0.0872 0.0870 0.0825 0.1022 0.0901 0.0907 0.0859 0.0925 0.0823 0.0865 0.0893 0.0784 0.0869 0.0843 0.1095 0.0848 0.0979 0.1035 0.0955 0.0711 0.0605 0.2446 0.0848 0.0828 0.0755
va: 2.1229 2.1135 3.7351 3.8331 3.8323 3.8980 3.9094 3.8975 4.2146 3.7351 3.9424 3.9413 3.9212 3.8009 4.0018 3.9482 3.8001 3.9438 3.4590 3.9136 1.0258 1.0330 1.0037 1.0017 1.0198 1.0066 1.0010 1.0050 1.0092 1.0193 1.0011 1.0013 1.0098 0.9985 0.9992 1.0233 1.0105 1.0082 0.9998 1.0206 1.0057 1.0138 0.9718 1.0072 1.0054 1.0064
dispcorr: -0.021160045 hartree
energy: -852.016228660711
dipole: 6.40371 -6.36750 0.03621 11.36238 -11.32353 0.03885 -4.39718 3.84588 -0.55130
magnitude: 0.55385 au
magnitude: 1.40778 debye
