program: Orca
programVersion: 5.0.2
elementType: O O O O N C C C C C C C C C C C C C C C C C C C C C C C C H H H H H H H H H H H H H H H H H H H H H H H H H
charge: 0
multiplicity: 1
keywords: wb97x-d3
keywords: def2-TZVPP
keywords: def2/J RIJCOSX
keywords: DEFGRID2
keywords: scfconv7
keywords: smallprint printgap noloewdin
keywords: NOSOSCF
formula: C24H25NO4
InChI: InChI=1/C24H25NO4/c1-23(2)19(21-24(3,4)29-21)20(23)22(26)28-18(14-25)15-9-8-12-17(13-15)27-16-10-6-5-7-11-16/h5-13,18-21H,1-4H3
54 atoms
O  -0.948714 2.837488 -1.23225
O  -1.516669 -1.090217 0.300974
O  -3.566539 -1.735518 -0.279779
O  3.576782 -0.645844 0.541827
N  -1.02524 -2.730303 -2.61921
C  -2.51514 1.723692 0.312923
C  -2.702419 1.283112 1.722595
C  -3.290106 0.441634 0.596923
C  -1.199458 1.7083 -0.397213
C  -1.101463 1.554867 -1.850542
C  -1.545652 0.815987 2.573723
C  -3.745917 2.021204 2.530204
C  -2.832071 -0.88534 0.167776
C  0.154952 0.999054 -2.461001
C  -2.337471 1.361837 -2.686247
C  -1.009103 -2.374594 -0.025421
C  0.396103 -2.47769 0.513423
C  -1.027922 -2.558416 -1.481603
C  1.31926 -1.472513 0.238421
C  0.746428 -3.575537 1.282548
C  2.598831 -1.569602 0.763319
C  2.039236 -3.667167 1.784382
C  2.963211 -2.669383 1.536434
C  3.26336 0.606543 0.059577
C  3.820201 0.993114 -1.149157
C  2.474531 1.479386 0.79732
C  3.593028 2.27943 -1.621757
C  2.244248 2.757142 0.306813
C  2.801349 3.161478 -0.900246
H  -3.164434 2.529369 -0.014366
H  -4.363243 0.527365 0.476233
H  -0.336086 1.407452 0.192576
H  -0.702331 0.408939 2.022964
H  -1.17202 1.662568 3.152345
H  -1.875865 0.056702 3.284114
H  -3.308383 2.901881 3.003534
H  -4.147718 1.383409 3.319354
H  -4.580145 2.354636 1.912148
H  0.38707 1.513428 -3.396086
H  0.029555 -0.058922 -2.691856
H  1.012555 1.100188 -1.797024
H  -2.54346 0.29577 -2.797398
H  -2.190158 1.771547 -3.687265
H  -3.22042 1.832249 -2.256821
H  -1.626267 -3.165016 0.411462
H  1.036285 -0.629582 -0.378215
H  0.020773 -4.350084 1.493481
H  2.324949 -4.519437 2.385954
H  3.967096 -2.735964 1.935974
H  4.433643 0.298636 -1.709038
H  2.046193 1.169765 1.743019
H  4.030586 2.584867 -2.563161
H  1.628891 3.441155 0.876378
H  2.620309 4.16036 -1.274412
elementType: O N C H
totalener: -1285.31727425 hartree
nucrepener: 2893.47706646 hartree
electener: -4178.79434071 hartree
oneelecener: -7500.27851377 hartree
twoeener: 3321.48417306 hartree
cpcmener: -0.04471044 hartree
kineticenergy: 1279.66345345 hartree
xcener: -124.710921887677 hartree
chargesum: 0.0000000
charge: -0.488715 -0.263194 -0.474534 -0.334762 -0.101752 -0.099895 0.100587 -0.126428 0.198558 0.213883 -0.257133 -0.265237 0.419750 -0.214202 -0.278920 0.387077 -0.005179 -0.224427 -0.180855 -0.185973 0.286673 -0.111913 -0.252930 0.271896 -0.196277 -0.180683 -0.141646 -0.154412 -0.178157 0.102969 0.093342 0.074875 0.064294 0.101204 0.108047 0.095845 0.098450 0.090794 0.119336 0.099584 0.002801 0.090857 0.108319 0.099082 0.133241 0.100288 0.148406 0.161783 0.148704 0.147919 0.166049 0.159471 0.162470 0.160675
qa: -0.4887 -0.2632 -0.4745 -0.3348 -0.1018 -0.0999 0.1006 -0.1264 0.1986 0.2139 -0.2571 -0.2652 0.4197 -0.2142 -0.2789 0.3871 -0.0052 -0.2244 -0.1809 -0.1860 0.2867 -0.1119 -0.2529 0.2719 -0.1963 -0.1807 -0.1416 -0.1544 -0.1782 0.1030 0.0933 0.0749 0.0643 0.1012 0.1080 0.0958 0.0984 0.0908 0.1193 0.0996 0.0028 0.0909 0.1083 0.0991 0.1332 0.1003 0.1484 0.1618 0.1487 0.1479 0.1660 0.1595 0.1625 0.1607
va: 1.9044 2.1583 2.0258 2.0878 3.0860 3.8654 3.8098 3.9199 3.7891 3.7602 3.9155 3.9024 4.0924 3.9528 3.9685 3.7730 3.7210 3.9999 3.9052 3.9270 3.7615 3.9056 3.9902 3.6756 3.9532 3.8586 3.8611 3.8208 3.8499 1.0203 1.0291 0.9883 1.0033 1.0020 1.0012 1.0020 1.0013 1.0051 1.0085 1.0184 1.0184 1.0070 1.0020 1.0027 1.0241 1.0207 0.9997 0.9880 1.0077 1.0043 0.9913 0.9894 0.9914 0.9907
dispcorr: -0.036109237 hartree
energy: -1285.353383483667
dipole: -9.01170 9.42977 0.41807 15.47562 -15.06278 0.41284 4.13532 -1.70181 2.43351
magnitude: 2.50343 au
magnitude: 6.36322 debye
