program: Orca
programVersion: 5.0.2
elementType: O O O O N C C C C C C C C C C C C C C C C C C C C C C C C H H H H H H H H H H H H H H H H H H H H H H H H H
charge: 0
multiplicity: 1
keywords: wb97x-d3
keywords: def2-TZVPP
keywords: def2/J RIJCOSX
keywords: DEFGRID2
keywords: scfconv7
keywords: smallprint printgap noloewdin
keywords: NOSOSCF
formula: C24H25NO4
InChI: InChI=1/C24H25NO4/c1-23(2)19(21-24(3,4)29-21)20(23)22(26)28-18(14-25)15-9-8-12-17(13-15)27-16-10-6-5-7-11-16/h5-13,18-21H,1-4H3
54 atoms
O  -1.936013 3.475374 -0.978646
O  -1.654773 -1.744813 0.525068
O  -1.272088 0.223209 1.530966
O  3.193239 -0.561052 -1.537499
N  -1.337981 -4.538534 2.265976
C  -3.237921 1.449239 -0.393799
C  -4.188828 0.86768 0.590594
C  -3.096797 -0.015901 -0.00305
C  -2.193826 2.452021 -0.018892
C  -0.896196 2.533387 -0.690304
C  -4.16841 1.271805 2.04302
C  -5.58017 0.555201 0.093024
C  -1.931489 -0.448057 0.775795
C  0.281661 3.087705 0.063035
C  -0.539264 1.59456 -1.810844
C  -0.510783 -2.325861 1.149755
C  0.577811 -2.537432 0.126554
C  -0.97528 -3.571521 1.760035
C  1.395216 -1.449248 -0.167667
C  0.731193 -3.739735 -0.547505
C  2.375678 -1.577944 -1.140372
C  1.71797 -3.852828 -1.517984
C  2.541536 -2.782746 -1.815996
C  3.44432 0.535438 -0.749302
C  3.739672 0.430341 0.60429
C  3.476498 1.766259 -1.389541
C  4.048841 1.579159 1.318588
C  3.809932 2.90296 -0.666777
C  4.086745 2.817271 0.69042
H  -3.622168 1.576845 -1.400581
H  -3.433241 -0.738207 -0.736627
H  -2.240544 2.825179 1.00225
H  -4.597073 0.479386 2.658369
H  -3.181988 1.496295 2.438382
H  -4.78563 2.161291 2.179466
H  -6.221366 1.433233 0.189861
H  -6.030164 -0.251521 0.673906
H  -5.581127 0.255942 -0.95543
H  0.923262 3.67574 -0.595137
H  0.885077 2.27236 0.466618
H  -0.027346 3.720651 0.895406
H  -1.410407 1.239506 -2.359934
H  -0.011278 0.723639 -1.418921
H  0.129759 2.085663 -2.520414
H  -0.141738 -1.69002 1.958909
H  1.255248 -0.516541 0.364102
H  0.098424 -4.589809 -0.32741
H  1.848169 -4.787818 -2.045726
H  3.309895 -2.8730 -2.573177
H  3.736324 -0.53062 1.102602
H  3.251396 1.83139 -2.446558
H  4.272497 1.498578 2.374192
H  3.839805 3.86083 -1.169188
H  4.336019 3.706347 1.253921
elementType: O N C H
totalener: -1285.31763993 hartree
nucrepener: 2793.99527831 hartree
electener: -4079.31291824 hartree
oneelecener: -7301.55954335 hartree
twoeener: 3222.24662511 hartree
cpcmener: -0.03919578 hartree
kineticenergy: 1279.65414730 hartree
xcener: -124.706348546925 hartree
chargesum: -0.0000000
charge: -0.482597 -0.284693 -0.470634 -0.330703 -0.100751 -0.089100 0.084828 -0.097995 0.120051 0.243097 -0.290591 -0.257302 0.403398 -0.276946 -0.293803 0.406784 -0.023251 -0.215393 -0.234360 -0.209197 0.356854 -0.107577 -0.264527 0.329656 -0.229724 -0.258216 -0.127289 -0.134029 -0.186047 0.108460 0.093990 0.123515 0.102744 0.092444 0.106019 0.096896 0.097020 0.090209 0.107253 0.063260 0.104191 0.110565 0.082783 0.111912 0.137937 0.147996 0.139465 0.163234 0.148045 0.161518 0.146591 0.161659 0.161697 0.160652
qa: -0.4826 -0.2847 -0.4706 -0.3307 -0.1008 -0.0891 0.0848 -0.0980 0.1201 0.2431 -0.2906 -0.2573 0.4034 -0.2769 -0.2938 0.4068 -0.0233 -0.2154 -0.2344 -0.2092 0.3569 -0.1076 -0.2645 0.3297 -0.2297 -0.2582 -0.1273 -0.1340 -0.1860 0.1085 0.0940 0.1235 0.1027 0.0924 0.1060 0.0969 0.0970 0.0902 0.1073 0.0633 0.1042 0.1106 0.0828 0.1119 0.1379 0.1480 0.1395 0.1632 0.1480 0.1615 0.1466 0.1617 0.1617 0.1607
va: 1.9226 2.1144 2.0241 2.0786 3.1115 3.8192 3.8138 3.8863 3.9051 3.7324 3.9033 3.8933 4.0689 3.9673 3.9646 3.7190 3.7956 4.0770 3.8989 3.9815 3.6263 3.9103 4.0236 3.5937 3.9171 3.9445 3.8535 3.8215 3.8799 1.0195 1.0314 0.9964 1.0000 1.0178 0.9979 1.0016 1.0023 1.0048 0.9980 1.0061 1.0111 1.0058 0.9975 1.0027 1.0295 0.9924 1.0127 0.9879 1.0071 0.9950 1.0100 0.9888 0.9890 0.9898
dispcorr: -0.032206887 hartree
energy: -1285.349846814409
dipole: -12.60147 12.95659 0.35512 17.92021 -17.48975 0.43046 -1.10425 0.55524 -0.54901
magnitude: 0.78283 au
magnitude: 1.98978 debye
