program: Orca
programVersion: 5.0.2
elementType: O O O O N C C C C C C C C C C C C C C C C C C C C C C C C H H H H H H H H H H H H H H H H H H H H H H H H H
charge: 0
multiplicity: 1
keywords: wb97x-d3
keywords: def2-TZVPP
keywords: def2/J RIJCOSX
keywords: DEFGRID2
keywords: scfconv7
keywords: smallprint printgap noloewdin
keywords: NOSOSCF
formula: C24H25NO4
InChI: InChI=1/C24H25NO4/c1-23(2)19(21-24(3,4)29-21)20(23)22(26)28-18(14-25)15-9-8-12-17(13-15)27-16-10-6-5-7-11-16/h5-13,18-21H,1-4H3
54 atoms
O  -2.023446 3.348899 -1.21249
O  -1.677759 -1.733901 0.60117
O  -1.261712 0.280093 1.494274
O  3.242246 -0.519609 -1.514348
N  -1.156029 -4.495973 2.350536
C  -3.317748 1.398459 -0.401443
C  -4.212311 0.893416 0.674308
C  -3.165469 -0.040143 0.077429
C  -2.247938 2.414936 -0.157045
C  -0.980669 2.422893 -0.887708
C  -4.104177 1.392362 2.093933
C  -5.633269 0.564846 0.282808
C  -1.956126 -0.429877 0.809042
C  0.232962 3.025773 -0.235347
C  -0.683671 1.386887 -1.937039
C  -0.481716 -2.263416 1.171632
C  0.565784 -2.453452 0.102906
C  -0.863425 -3.517943 1.820871
C  1.425528 -1.389571 -0.155546
C  0.64314 -3.622917 -0.640022
C  2.378728 -1.513208 -1.15714
C  1.599428 -3.72938 -1.640469
C  2.469502 -2.68563 -1.899614
C  3.533192 0.530579 -0.677214
C  3.872527 0.342895 0.656871
C  3.550964 1.795885 -1.24416
C  4.210559 1.445334 1.428244
C  3.910295 2.887019 -0.465076
C  4.231281 2.718732 0.874223
H  -3.761267 1.462997 -1.389988
H  -3.549344 -0.803496 -0.587966
H  -2.248569 2.874237 0.829611
H  -3.096667 1.644817 2.412825
H  -4.717175 2.288307 2.208072
H  -4.489703 0.641166 2.784917
H  -6.050019 -0.203555 0.935875
H  -5.701165 0.206118 -0.744523
H  -6.262594 1.452363 0.368802
H  0.863812 3.526422 -0.971401
H  0.832186 2.244808 0.235055
H  -0.036866 3.749995 0.533222
H  -0.052619 1.811206 -2.720642
H  -1.58255 0.990253 -2.407252
H  -0.134899 0.552282 -1.498418
H  -0.097336 -1.606013 1.956611
H  1.340666 -0.481342 0.427543
H  -0.025382 -4.452023 -0.446608
H  1.672197 -4.638946 -2.220883
H  3.217559 -2.772829 -2.677106
H  3.878904 -0.646702 1.095223
H  3.289735 1.924786 -2.286706
H  4.469354 1.301638 2.468968
H  3.92748 3.873505 -0.908791
H  4.502566 3.571616 1.481534
elementType: O N C H
totalener: -1285.31772454 hartree
nucrepener: 2790.00718744 hartree
electener: -4075.32491198 hartree
oneelecener: -7293.61287491 hartree
twoeener: 3218.28796293 hartree
cpcmener: -0.03939190 hartree
kineticenergy: 1279.65842848 hartree
xcener: -124.706658800860 hartree
chargesum: -0.0000000
charge: -0.482398 -0.284856 -0.470449 -0.330710 -0.102712 -0.088987 0.085740 -0.096728 0.114822 0.242127 -0.290349 -0.257276 0.399843 -0.270963 -0.286877 0.406939 -0.009551 -0.213368 -0.239367 -0.213859 0.355220 -0.111365 -0.259455 0.325511 -0.227471 -0.254178 -0.133875 -0.143085 -0.173935 0.108449 0.094652 0.122962 0.092110 0.105537 0.102771 0.097250 0.090218 0.096784 0.103956 0.065463 0.103484 0.111590 0.107481 0.082651 0.135632 0.145531 0.139761 0.162855 0.148281 0.161028 0.147062 0.162702 0.161297 0.162101
qa: -0.4824 -0.2849 -0.4704 -0.3307 -0.1027 -0.0890 0.0857 -0.0967 0.1148 0.2421 -0.2903 -0.2573 0.3998 -0.2710 -0.2869 0.4069 -0.0096 -0.2134 -0.2394 -0.2139 0.3552 -0.1114 -0.2595 0.3255 -0.2275 -0.2542 -0.1339 -0.1431 -0.1739 0.1084 0.0947 0.1230 0.0921 0.1055 0.1028 0.0972 0.0902 0.0968 0.1040 0.0655 0.1035 0.1116 0.1075 0.0827 0.1356 0.1455 0.1398 0.1629 0.1483 0.1610 0.1471 0.1627 0.1613 0.1621
va: 1.9211 2.1156 2.0241 2.0758 3.1099 3.8243 3.8106 3.8772 3.9062 3.7432 3.9029 3.8935 4.0725 3.9696 3.9594 3.7179 3.7568 4.0747 3.8858 3.9949 3.6281 3.9079 4.0235 3.5992 3.9216 3.9477 3.8718 3.8438 3.8870 1.0198 1.0312 0.9965 1.0179 0.9979 0.9999 1.0022 1.0047 1.0017 0.9981 1.0046 1.0103 1.0038 1.0055 1.0006 1.0296 0.9998 1.0113 0.9881 1.0069 0.9956 1.0103 0.9886 0.9892 0.9887
dispcorr: -0.031935699 hartree
energy: -1285.349660240261
dipole: -13.11816 13.37444 0.25628 17.56689 -17.09311 0.47378 -1.26582 0.78810 -0.47772
magnitude: 0.71997 au
magnitude: 1.83002 debye
