program: Orca
programVersion: 5.0.2
elementType: O O O O N C C C C C C C C C C C C C C C C C C C C C C C C H H H H H H H H H H H H H H H H H H H H H H H H H
charge: 0
multiplicity: 1
keywords: wb97x-d3
keywords: def2-TZVPP
keywords: def2/J RIJCOSX
keywords: DEFGRID2
keywords: scfconv7
keywords: smallprint printgap noloewdin
keywords: NOSOSCF
formula: C24H25NO4
InChI: InChI=1/C24H25NO4/c1-23(2)19(21-24(3,4)29-21)20(23)22(26)28-18(14-25)15-9-8-12-17(13-15)27-16-10-6-5-7-11-16/h5-13,18-21H,1-4H3
54 atoms
O  -2.406279 2.507394 -2.17434
O  -1.73922 -1.729177 1.044663
O  -0.806444 0.295691 1.146743
O  3.651919 -0.564816 -0.781137
N  -0.914202 -4.833002 1.760717
C  -3.352872 1.257258 -0.255587
C  -3.703056 1.402662 1.182267
C  -3.15275 0.072357 0.684863
C  -2.175381 1.915102 -0.897183
C  -1.549936 1.362203 -2.099265
C  -2.916013 2.293383 2.110659
C  -5.175241 1.372594 1.52064
C  -1.789931 -0.38422 0.983701
C  -0.092883 1.625848 -2.358393
C  -2.080203 0.105616 -2.735571
C  -0.455554 -2.306947 1.273609
C  0.463856 -2.149628 0.085156
C  -0.726031 -3.720271 1.539028
C  1.655044 -1.457402 0.241309
C  0.090811 -2.648986 -1.15678
C  2.459262 -1.229843 -0.866861
C  0.916524 -2.435185 -2.249424
C  2.094356 -1.715378 -2.114603
C  3.791368 0.533898 0.031042
C  2.75912 1.432755 0.272795
C  5.054876 0.748157 0.564976
C  3.002659 2.545096 1.066218
C  5.28548 1.871336 1.345779
C  4.261095 2.771179 1.606693
H  -4.191662 1.11584 -0.929082
H  -3.876155 -0.727669 0.586801
H  -1.549232 2.524448 -0.24966
H  -3.348917 3.295039 2.096042
H  -2.983048 1.923022 3.134666
H  -1.863312 2.392091 1.864769
H  -5.602642 2.373279 1.435351
H  -5.333239 1.028406 2.544004
H  -5.733802 0.714252 0.854662
H  0.094741 1.765592 -3.424782
H  0.500487 0.770162 -2.032729
H  0.265508 2.50814 -1.82741
H  -3.157907 -0.003273 -2.626285
H  -1.605441 -0.76794 -2.28736
H  -1.847157 0.090864 -3.801955
H  0.007687 -1.887835 2.172555
H  1.937191 -1.086602 1.218819
H  -0.836874 -3.195112 -1.277113
H  0.63433 -2.817477 -3.220973
H  2.728622 -1.532187 -2.972375
H  1.773661 1.282301 -0.147561
H  5.852014 0.043877 0.363792
H  2.196263 3.241363 1.2562
H  6.272662 2.036669 1.756851
H  4.442135 3.641608 2.222782
elementType: O N C H
totalener: -1285.31690159 hartree
nucrepener: 2812.32910011 hartree
electener: -4097.64600170 hartree
oneelecener: -7338.21955127 hartree
twoeener: 3240.57354957 hartree
cpcmener: -0.04113697 hartree
kineticenergy: 1279.67112758 hartree
xcener: -124.709630526194 hartree
chargesum: -0.0000000
charge: -0.482885 -0.280123 -0.472633 -0.337704 -0.101169 -0.116553 0.081225 -0.061013 0.133597 0.239206 -0.287560 -0.258594 0.369163 -0.249131 -0.290267 0.422516 0.040391 -0.218252 -0.220395 -0.244298 0.310513 -0.130874 -0.227208 0.291655 -0.176896 -0.246544 -0.174195 -0.132160 -0.180174 0.108440 0.094468 0.122989 0.101301 0.103603 0.094701 0.097058 0.097438 0.090229 0.111089 0.034960 0.099458 0.103209 0.092922 0.110062 0.140104 0.146924 0.152255 0.162618 0.147723 0.159484 0.147623 0.159717 0.161477 0.160515
qa: -0.4829 -0.2801 -0.4726 -0.3377 -0.1012 -0.1166 0.0812 -0.0610 0.1336 0.2392 -0.2876 -0.2586 0.3692 -0.2491 -0.2903 0.4225 0.0404 -0.2183 -0.2204 -0.2443 0.3105 -0.1309 -0.2272 0.2917 -0.1769 -0.2465 -0.1742 -0.1322 -0.1802 0.1084 0.0945 0.1230 0.1013 0.1036 0.0947 0.0971 0.0974 0.0902 0.1111 0.0350 0.0995 0.1032 0.0929 0.1101 0.1401 0.1469 0.1523 0.1626 0.1477 0.1595 0.1476 0.1597 0.1615 0.1605
va: 1.9236 2.1357 2.0207 2.0809 3.1116 3.8099 3.8253 3.8701 3.8945 3.7443 3.8960 3.8935 4.1125 3.9449 3.9532 3.7383 3.5294 4.0768 3.9397 3.9195 3.6666 3.8605 3.9562 3.6825 3.8665 3.9868 3.9383 3.8839 3.8968 1.0170 1.0298 0.9976 0.9994 0.9988 1.0191 1.0016 1.0020 1.0049 1.0109 1.0233 1.0059 1.0074 1.0075 1.0019 1.0155 1.0061 1.0085 0.9884 1.0056 0.9701 1.0077 0.9925 0.9878 0.9896
dispcorr: -0.032681556 hartree
energy: -1285.349583147834
dipole: -14.73228 14.36342 -0.36887 17.64184 -16.74418 0.89766 -3.47391 3.63866 0.16475
magnitude: 0.98438 au
magnitude: 2.50209 debye
