program: Orca
programVersion: 5.0.2
elementType: O O O O N C C C C C C C C C C C C C C C C C C C C C C C C H H H H H H H H H H H H H H H H H H H H H H H H H
charge: 0
multiplicity: 1
keywords: wb97x-d3
keywords: def2-TZVPP
keywords: def2/J RIJCOSX
keywords: DEFGRID2
keywords: scfconv7
keywords: smallprint printgap noloewdin
keywords: NOSOSCF
formula: C24H25NO4
InChI: InChI=1/C24H25NO4/c1-23(2)19(21-24(3,4)29-21)20(23)22(26)28-18(14-25)15-9-8-12-17(13-15)27-16-10-6-5-7-11-16/h5-13,18-21H,1-4H3
54 atoms
O  -2.902434 3.355844 -0.88682
O  -1.244143 -1.653664 0.026868
O  -2.579557 -0.280095 1.17668
O  3.310216 0.943053 0.307244
N  0.76055 -4.171467 0.762439
C  -3.274911 0.98326 -1.487921
C  -4.2455 -0.142865 -1.459131
C  -2.770799 -0.429128 -1.210257
C  -3.221348 2.041924 -0.432657
C  -1.972899 2.689341 -0.026308
C  -5.272895 -0.277156 -0.363322
C  -4.754619 -0.635254 -2.793352
C  -2.236189 -0.746289 0.117776
C  -1.861673 3.254341 1.363371
C  -0.661021 2.309035 -0.655844
C  -0.55273 -1.962191 1.234096
C  0.406368 -0.865249 1.629411
C  0.168233 -3.204479 0.955407
C  1.43735 -0.515991 0.763758
C  0.222483 -0.186463 2.824192
C  2.299457 0.51061 1.119044
C  1.083691 0.849694 3.157349
C  2.123915 1.199541 2.313345
C  3.975459 0.067894 -0.517395
C  4.298573 0.525215 -1.78638
C  4.375635 -1.19258 -0.091396
C  5.032884 -0.288527 -2.637357
C  5.097143 -2.000155 -0.958494
C  5.429046 -1.55502 -2.231311
H  -2.995281 1.3394 -2.474147
H  -2.245456 -0.909573 -2.026465
H  -4.026338 2.024748 0.299521
H  -5.562058 -1.322612 -0.246541
H  -4.952061 0.085577 0.608753
H  -6.168988 0.280843 -0.640348
H  -5.051187 -1.683748 -2.73403
H  -4.001566 -0.543199 -3.576545
H  -5.62855 -0.058343 -3.101054
H  -1.383568 2.528508 2.023138
H  -2.837487 3.498199 1.783826
H  -1.249443 4.15805 1.371246
H  -0.161692 1.551366 -0.050796
H  0.003308 3.174128 -0.702157
H  -0.771644 1.915144 -1.665149
H  -1.251181 -2.168771 2.05058
H  1.560207 -1.038263 -0.178045
H  -0.584782 -0.462534 3.489691
H  0.945915 1.388939 4.084745
H  2.798255 2.005076 2.574248
H  3.985037 1.512496 -2.101046
H  4.13467 -1.54777 0.902599
H  5.289166 0.071424 -3.625069
H  5.406189 -2.983522 -0.629516
H  5.996553 -2.189068 -2.89912
elementType: O N C H
totalener: -1285.31814870 hartree
nucrepener: 2770.46994922 hartree
electener: -4055.78809792 hartree
oneelecener: -7255.03190346 hartree
twoeener: 3199.24380554 hartree
cpcmener: -0.04037713 hartree
kineticenergy: 1279.66830594 hartree
xcener: -124.707838223354 hartree
chargesum: -0.0000000
charge: -0.480196 -0.288205 -0.468967 -0.339024 -0.102600 -0.091268 0.089128 -0.080449 0.100612 0.226442 -0.290995 -0.259072 0.371688 -0.263706 -0.238543 0.450015 0.024718 -0.229431 -0.205351 -0.203694 0.268124 -0.128327 -0.231663 0.301233 -0.259519 -0.205084 -0.119595 -0.141189 -0.189501 0.107675 0.095143 0.124124 0.103039 0.092401 0.104313 0.097045 0.090808 0.097565 0.084098 0.097035 0.102910 0.029787 0.113225 0.105227 0.142534 0.147728 0.147085 0.162217 0.149955 0.148438 0.157321 0.161480 0.162407 0.160860
qa: -0.4802 -0.2882 -0.4690 -0.3390 -0.1026 -0.0913 0.0891 -0.0804 0.1006 0.2264 -0.2910 -0.2591 0.3717 -0.2637 -0.2385 0.4500 0.0247 -0.2294 -0.2054 -0.2037 0.2681 -0.1283 -0.2317 0.3012 -0.2595 -0.2051 -0.1196 -0.1412 -0.1895 0.1077 0.0951 0.1241 0.1030 0.0924 0.1043 0.0970 0.0908 0.0976 0.0841 0.0970 0.1029 0.0298 0.1132 0.1052 0.1425 0.1477 0.1471 0.1622 0.1500 0.1484 0.1573 0.1615 0.1624 0.1609
va: 1.9215 2.1305 2.0254 2.0602 3.1091 3.8307 3.8074 3.8708 3.9190 3.7561 3.8995 3.8927 4.1029 3.9436 3.9298 3.7177 3.5530 4.0846 3.8883 3.9092 3.7007 3.8766 3.9909 3.6667 4.0141 3.9118 3.8743 3.8799 3.9023 1.0201 1.0305 0.9965 0.9997 1.0183 0.9981 1.0023 1.0045 1.0015 1.0058 1.0088 1.0036 1.0382 1.0057 1.0066 1.0150 1.0138 1.0074 0.9883 1.0043 1.0079 0.9977 0.9880 0.9891 0.9896
dispcorr: -0.031190654 hartree
energy: -1285.349339351189
dipole: -17.55873 17.18243 -0.37630 10.26508 -10.18570 0.07938 -6.92973 6.94456 0.01484
magnitude: 0.38487 au
magnitude: 0.97826 debye
