program: Orca
programVersion: 5.0.2
elementType: O O O O N C C C C C C C C C C C C C C C C C C C C C C C C H H H H H H H H H H H H H H H H H H H H H H H H H
charge: 0
multiplicity: 1
keywords: wb97x-d3
keywords: def2-TZVPP
keywords: def2/J RIJCOSX
keywords: DEFGRID2
keywords: scfconv7
keywords: smallprint printgap noloewdin
keywords: NOSOSCF
formula: C24H25NO4
InChI: InChI=1/C24H25NO4/c1-23(2)19(21-24(3,4)29-21)20(23)22(26)28-18(14-25)15-9-8-12-17(13-15)27-16-10-6-5-7-11-16/h5-13,18-21H,1-4H3
54 atoms
O  -4.492148 1.956949 -1.847751
O  -1.571695 -1.768975 0.916274
O  -1.337609 -0.580319 -0.954023
O  3.055113 -0.210954 1.812343
N  -1.914197 -3.784048 -1.783705
C  -3.19469 1.48952 0.204296
C  -1.972224 1.797277 0.996578
C  -2.484699 0.361025 0.931106
C  -3.243606 1.553857 -1.290894
C  -4.034804 0.627834 -2.102507
C  -0.67335 2.185246 0.334487
C  -2.169179 2.470566 2.333701
C  -1.753377 -0.656479 0.173603
C  -3.61415 0.356387 -3.521155
C  -4.840977 -0.472858 -1.466865
C  -0.773548 -2.789436 0.3512
C  0.669653 -2.370337 0.145542
C  -1.402857 -3.314219 -0.868964
C  1.228018 -1.458695 1.034673
C  1.443979 -2.90905 -0.87143
C  2.553445 -1.082478 0.888753
C  2.775711 -2.534759 -0.992984
C  3.341572 -1.620728 -0.120969
C  3.822698 0.8484 1.413007
C  4.822091 1.258876 2.284707
C  3.593097 1.53306 0.225528
C  5.596651 2.363883 1.963945
C  4.384008 2.630354 -0.086074
C  5.386201 3.051729 0.776739
H  -4.13407 1.761609 0.675489
H  -2.957753 -0.006669 1.833981
H  -2.384089 2.019091 -1.771146
H  -0.65014 3.266607 0.185543
H  0.169437 1.927124 0.978901
H  -0.499077 1.721488 -0.633142
H  -2.186021 3.555696 2.214759
H  -1.355505 2.224105 3.018352
H  -3.106042 2.173773 2.806686
H  -4.483638 0.205836 -4.164486
H  -3.009191 -0.550104 -3.569335
H  -3.024284 1.175163 -3.934715
H  -5.75701 -0.649229 -2.034966
H  -5.124782 -0.252754 -0.438357
H  -4.276794 -1.407059 -1.469656
H  -0.808695 -3.600961 1.08432
H  0.65055 -1.028585 1.843993
H  1.026987 -3.617208 -1.576139
H  3.379578 -2.960409 -1.78346
H  4.380808 -1.336404 -0.227316
H  4.987521 0.718472 3.208451
H  2.807338 1.226472 -0.453635
H  6.374021 2.682129 2.64662
H  4.206063 3.162145 -1.011946
H  5.996889 3.909179 0.526847
elementType: O N C H
totalener: -1285.32691867 hartree
nucrepener: 2754.25625132 hartree
electener: -4039.58316998 hartree
oneelecener: -7222.88369753 hartree
twoeener: 3183.30052754 hartree
cpcmener: -0.03561679 hartree
kineticenergy: 1279.68130784 hartree
xcener: -124.710180986806 hartree
chargesum: -0.0000000
charge: -0.456778 -0.295499 -0.434750 -0.330243 -0.097891 -0.096827 0.111283 -0.069199 0.098649 0.220131 -0.305816 -0.258431 0.345632 -0.256113 -0.279516 0.540085 -0.027937 -0.254474 -0.296543 -0.199729 0.265597 -0.117595 -0.182457 0.299608 -0.251728 -0.194953 -0.122222 -0.156275 -0.183567 0.108593 0.094475 0.118698 0.111448 0.095329 0.096423 0.097131 0.096873 0.090176 0.098915 0.085898 0.090795 0.108121 0.098396 0.086355 0.147569 0.135520 0.133616 0.161435 0.158078 0.145232 0.154524 0.157227 0.158888 0.157842
qa: -0.4568 -0.2955 -0.4347 -0.3302 -0.0979 -0.0968 0.1113 -0.0692 0.0986 0.2201 -0.3058 -0.2584 0.3456 -0.2561 -0.2795 0.5401 -0.0279 -0.2545 -0.2965 -0.1997 0.2656 -0.1176 -0.1825 0.2996 -0.2517 -0.1950 -0.1222 -0.1563 -0.1836 0.1086 0.0945 0.1187 0.1114 0.0953 0.0964 0.0971 0.0969 0.0902 0.0989 0.0859 0.0908 0.1081 0.0984 0.0864 0.1476 0.1355 0.1336 0.1614 0.1581 0.1452 0.1545 0.1572 0.1589 0.1578
va: 1.9464 2.1257 2.0494 2.0617 3.0862 3.8663 3.7929 3.8459 3.9353 3.7654 3.9063 3.8904 4.0832 3.9460 3.9663 3.7657 3.7577 4.0854 4.0612 3.9686 3.7574 3.9127 3.9424 3.6610 4.0081 3.8793 3.8921 3.9085 3.9038 1.0187 1.0308 0.9962 0.9998 1.0007 1.0163 1.0018 1.0026 1.0043 1.0034 1.0092 1.0072 1.0041 1.0022 1.0066 0.9860 1.0272 1.0171 0.9904 0.9950 1.0086 0.9985 0.9892 0.9907 0.9903
dispcorr: -0.030189678 hartree
energy: -1285.357108345550
dipole: -9.69368 11.29869 1.60501 15.66179 -15.34211 0.31967 -2.20805 4.13343 1.92538
magnitude: 2.52692 au
magnitude: 6.42292 debye
