program: Orca
programVersion: 5.0.2
elementType: O O O O N C C C C C C C C C C C C C C C C C C C C C C C C H H H H H H H H H H H H H H H H H H H H H H H H H
charge: 0
multiplicity: 1
keywords: wb97x-d3
keywords: def2-TZVPP
keywords: def2/J RIJCOSX
keywords: DEFGRID2
keywords: scfconv7
keywords: smallprint printgap noloewdin
keywords: NOSOSCF
formula: C24H25NO4
InChI: InChI=1/C24H25NO4/c1-23(2)19(21-24(3,4)29-21)20(23)22(26)28-18(14-25)15-9-8-12-17(13-15)27-16-10-6-5-7-11-16/h5-13,18-21H,1-4H3
54 atoms
O  -4.515638 1.553224 -1.338295
O  -1.107765 -0.641616 -0.418872
O  -0.948038 -0.97916 1.779816
O  3.904824 -0.623957 0.196602
N  -1.208376 -2.369784 -3.208845
C  -2.531986 1.88376 0.091938
C  -1.114343 2.336846 0.124446
C  -1.545313 1.17805 1.016153
C  -3.161296 1.197044 -1.080034
C  -4.237924 0.21489 -0.926279
C  -0.18827 2.156975 -1.053609
C  -0.834036 3.617173 0.877689
C  -1.170681 -0.234367 0.85859
C  -4.450162 -0.830698 -1.987475
C  -4.734802 -0.17094 0.441296
C  -0.745464 -1.986372 -0.665387
C  0.705369 -2.297531 -0.355516
C  -1.010184 -2.188144 -2.092405
C  1.645169 -1.281804 -0.28851
C  1.076238 -3.618396 -0.140591
C  2.950856 -1.590339 0.06904
C  2.398468 -3.916572 0.150119
C  3.339359 -2.905846 0.275726
C  3.583967 0.582578 0.761002
C  4.216124 1.703678 0.242687
C  2.711891 0.694853 1.839194
C  3.977066 2.947249 0.810535
C  2.474708 1.946652 2.38843
C  3.102174 3.076534 1.880033
H  -3.232263 2.508945 0.637043
H  -1.641763 1.427264 2.066202
H  -2.552482 1.129133 -1.979946
H  -0.395251 1.290206 -1.674136
H  -0.255487 3.036146 -1.69765
H  0.847448 2.084502 -0.715244
H  0.195764 3.639698 1.239058
H  -1.493493 3.739541 1.737593
H  -0.976483 4.480532 0.224721
H  -3.991693 -0.552804 -2.936966
H  -5.516828 -0.990995 -2.159429
H  -4.025112 -1.785465 -1.675348
H  -4.659914 0.641111 1.163298
H  -4.162536 -1.017007 0.825924
H  -5.780754 -0.481024 0.395151
H  -1.393066 -2.675157 -0.110835
H  1.370252 -0.253558 -0.486743
H  0.337851 -4.409033 -0.194078
H  2.695602 -4.944396 0.310991
H  4.364555 -3.133193 0.539259
H  4.895388 1.60041 -0.594404
H  2.219601 -0.175328 2.255149
H  4.475246 3.818926 0.4061
H  1.795139 2.033762 3.226556
H  2.913309 4.048084 2.317403
elementType: O N C H
totalener: -1285.32442972 hartree
nucrepener: 2846.04239869 hartree
electener: -4131.36682840 hartree
oneelecener: -7405.25581245 hartree
twoeener: 3273.88898405 hartree
cpcmener: -0.03676253 hartree
kineticenergy: 1279.67201864 hartree
xcener: -124.708588395587 hartree
chargesum: 0.0000000
charge: -0.455380 -0.265493 -0.433836 -0.326243 -0.083380 -0.121540 0.102061 -0.069847 0.140782 0.219960 -0.291052 -0.263070 0.349081 -0.290793 -0.284521 0.356499 0.042903 -0.237997 -0.190322 -0.221775 0.243865 -0.114422 -0.227376 0.284544 -0.241849 -0.182464 -0.109181 -0.167195 -0.187974 0.105298 0.092925 0.116741 0.093535 0.117342 0.078179 0.088699 0.091698 0.100020 0.096961 0.108607 0.084904 0.099637 0.093531 0.107152 0.152290 0.172774 0.144452 0.158736 0.147606 0.144628 0.151542 0.157741 0.161351 0.159666
qa: -0.4554 -0.2655 -0.4338 -0.3262 -0.0834 -0.1215 0.1021 -0.0698 0.1408 0.2200 -0.2911 -0.2631 0.3491 -0.2908 -0.2845 0.3565 0.0429 -0.2380 -0.1903 -0.2218 0.2439 -0.1144 -0.2274 0.2845 -0.2418 -0.1825 -0.1092 -0.1672 -0.1880 0.1053 0.0929 0.1167 0.0935 0.1173 0.0782 0.0887 0.0917 0.1000 0.0970 0.1086 0.0849 0.0996 0.0935 0.1072 0.1523 0.1728 0.1445 0.1587 0.1476 0.1446 0.1515 0.1577 0.1614 0.1597
va: 1.9504 2.0899 2.0643 2.0936 3.1042 3.8507 3.7491 3.8418 3.8968 3.7460 3.9031 3.8958 4.1382 3.9577 3.9637 3.7464 3.6202 4.0449 3.9365 3.9966 3.7923 3.8945 3.9997 3.6817 3.9994 3.8546 3.8760 3.8427 3.8667 1.0195 1.0268 1.0033 1.0135 1.0027 1.0054 1.0108 1.0056 1.0033 1.0041 1.0078 1.0021 1.0027 1.0065 1.0021 1.0112 0.9757 1.0018 0.9888 1.0049 1.0086 1.0041 0.9884 0.9905 0.9899
dispcorr: -0.034544140 hartree
energy: -1285.358973856547
dipole: -13.38307 13.92873 0.54566 14.03777 -13.65467 0.38309 2.87713 -1.47434 1.40279
magnitude: 1.55316 au
magnitude: 3.94783 debye
