program: Orca
programVersion: 5.0.2
elementType: O O O O N C C C C C C C C C C C C C C C C C C C C C C C C H H H H H H H H H H H H H H H H H H H H H H H H H
charge: 0
multiplicity: 1
keywords: wb97x-d3
keywords: def2-TZVPP
keywords: def2/J RIJCOSX
keywords: DEFGRID2
keywords: scfconv7
keywords: smallprint printgap noloewdin
keywords: NOSOSCF
formula: C24H25NO4
InChI: InChI=1/C24H25NO4/c1-23(2)19(21-24(3,4)29-21)20(23)22(26)28-18(14-25)15-9-8-12-17(13-15)27-16-10-6-5-7-11-16/h5-13,18-21H,1-4H3
54 atoms
O  -2.587742 3.389409 0.480522
O  -1.240977 -1.691341 -0.605317
O  -2.496757 -0.824648 1.023402
O  3.162724 0.679328 0.854353
N  0.745649 -4.272415 -1.033287
C  -3.091144 1.427165 -0.946593
C  -4.160489 0.451632 -1.291431
C  -2.716525 -0.0242 -1.231491
C  -2.90817 2.002874 0.420867
C  -1.599603 2.447824 0.902462
C  -5.18519 0.004866 -0.278788
C  -4.723269 0.531943 -2.691513
C  -2.186955 -0.853409 -0.140465
C  -1.315289 2.42074 2.378924
C  -0.381531 2.336872 0.024723
C  -0.567785 -2.492805 0.358078
C  0.391007 -1.693096 1.209832
C  0.161404 -3.488733 -0.430488
C  1.362033 -0.91438 0.589134
C  0.281616 -1.726341 2.591044
C  2.228343 -0.163629 1.371224
C  1.158368 -0.973001 3.359909
C  2.131692 -0.194517 2.758631
C  3.695287 0.481292 -0.392599
C  4.203005 -0.750136 -0.787458
C  3.778842 1.586096 -1.227342
C  4.794944 -0.866863 -2.036816
C  4.387642 1.457949 -2.468096
C  4.892134 0.232474 -2.879971
H  -2.792514 2.101215 -1.742807
H  -2.245817 -0.207256 -2.189859
H  -3.632588 1.694863 1.171823
H  -6.024796 0.702964 -0.281999
H  -5.577317 -0.97798 -0.546384
H  -4.818137 -0.058165 0.741721
H  -5.096382 -0.439904 -3.01984
H  -3.97673 0.864494 -3.413996
H  -5.555438 1.237797 -2.727774
H  -2.228864 2.463928 2.9728
H  -0.6786 3.258449 2.671174
H  -0.78829 1.501425 2.641787
H  0.050729 1.339157 0.106514
H  0.385261 3.049384 0.336332
H  -0.60131 2.521446 -1.026036
H  -1.278597 -3.030726 0.993597
H  1.428713 -0.886131 -0.492291
H  -0.482511 -2.329771 3.063809
H  1.081812 -0.990189 4.439029
H  2.81313 0.397277 3.356903
H  4.14587 -1.60975 -0.130973
H  3.380876 2.539532 -0.902187
H  5.190275 -1.825516 -2.347104
H  4.461674 2.322325 -3.115486
H  5.362703 0.134734 -3.849464
elementType: O N C H
totalener: -1285.32807138 hartree
nucrepener: 2792.43364002 hartree
electener: -4077.76171140 hartree
oneelecener: -7298.82203728 hartree
twoeener: 3221.06032588 hartree
cpcmener: -0.03440544 hartree
kineticenergy: 1279.67894762 hartree
xcener: -124.707638509445 hartree
chargesum: -0.0000000
charge: -0.456215 -0.283756 -0.442188 -0.322040 -0.087927 -0.100653 0.082223 -0.064516 0.124100 0.209784 -0.286798 -0.256566 0.338821 -0.243452 -0.272917 0.435352 0.007525 -0.232883 -0.203542 -0.191101 0.249644 -0.116116 -0.240956 0.299560 -0.208649 -0.250891 -0.135730 -0.118517 -0.182352 0.106744 0.093191 0.119982 0.102640 0.100779 0.094443 0.097009 0.088258 0.096457 0.093934 0.100274 0.066404 0.064565 0.107503 0.104293 0.139050 0.151252 0.142795 0.157314 0.145561 0.155942 0.146663 0.159288 0.158263 0.158152
qa: -0.4562 -0.2838 -0.4422 -0.3220 -0.0879 -0.1007 0.0822 -0.0645 0.1241 0.2098 -0.2868 -0.2566 0.3388 -0.2435 -0.2729 0.4354 0.0075 -0.2329 -0.2035 -0.1911 0.2496 -0.1161 -0.2410 0.2996 -0.2086 -0.2509 -0.1357 -0.1185 -0.1824 0.1067 0.0932 0.1200 0.1026 0.1008 0.0944 0.0970 0.0883 0.0965 0.0939 0.1003 0.0664 0.0646 0.1075 0.1043 0.1390 0.1513 0.1428 0.1573 0.1456 0.1559 0.1467 0.1593 0.1583 0.1582
va: 1.9573 2.1282 2.0552 2.0666 3.1122 3.8058 3.8232 3.8638 3.9219 3.8161 3.8963 3.8932 4.1465 3.9392 3.9480 3.7366 3.6118 4.0828 3.8710 3.9395 3.7099 3.8909 3.9844 3.6733 3.9316 4.0061 3.8841 3.8816 3.9094 1.0189 1.0301 0.9977 0.9987 0.9997 1.0199 1.0023 1.0049 1.0022 1.0104 1.0053 1.0103 1.0131 1.0037 1.0098 1.0159 1.0163 1.0057 0.9901 1.0073 0.9987 1.0080 0.9900 0.9895 0.9906
dispcorr: -0.031621779 hartree
energy: -1285.359693161388
dipole: -16.30939 15.96552 -0.34387 13.29499 -13.13681 0.15817 -3.07829 3.05428 -0.02401
magnitude: 0.37927 au
magnitude: 0.96402 debye
