program: Orca
programVersion: 5.0.2
elementType: O O O O N C C C C C C C C C C C C C C C C C C C C C C C C H H H H H H H H H H H H H H H H H H H H H H H H H
charge: 0
multiplicity: 1
keywords: wb97x-d3
keywords: def2-TZVPP
keywords: def2/J RIJCOSX
keywords: DEFGRID2
keywords: scfconv7
keywords: smallprint printgap noloewdin
keywords: NOSOSCF
formula: C24H25NO4
InChI: InChI=1/C24H25NO4/c1-23(2)19(21-24(3,4)29-21)20(23)22(26)28-18(14-25)15-9-8-12-17(13-15)27-16-10-6-5-7-11-16/h5-13,18-21H,1-4H3
54 atoms
O  -2.543456 2.398287 -2.049486
O  -1.898295 -1.055086 0.373788
O  -3.683452 -2.370312 0.172714
O  2.730623 0.790385 -0.006062
N  -0.991285 -3.15192 -2.100127
C  -3.668246 1.293668 -0.16296
C  -3.727721 1.157047 1.319166
C  -4.040568 -0.051974 0.448214
C  -2.406715 1.520034 -0.936405
C  -2.222013 1.032531 -2.307456
C  -2.48851 1.230894 2.179171
C  -4.937526 1.747496 2.006877
C  -3.22165 -1.265198 0.322122
C  -0.831804 0.813466 -2.840143
C  -3.289953 0.216328 -2.984206
C  -1.055627 -2.196822 0.336205
C  0.323223 -1.779699 0.779909
C  -1.030401 -2.737999 -1.02913
C  0.950334 -0.700059 0.174211
C  0.953723 -2.478687 1.79962
C  2.209195 -0.306805 0.604941
C  2.215313 -2.078707 2.215812
C  2.849437 -0.993008 1.632349
C  4.080437 1.034363 0.045696
C  4.504842 2.22698 0.609312
C  4.98774 0.14028 -0.507225
C  5.859556 2.531369 0.613784
C  6.339146 0.451543 -0.486574
C  6.77964 1.644541 0.072791
H  -4.524823 1.783659 -0.615511
H  -5.092455 -0.30292 0.377893
H  -1.508273 1.698599 -0.347324
H  -2.371725 2.252201 2.546903
H  -2.588203 0.581755 3.050908
H  -1.562889 0.966253 1.676192
H  -5.143415 1.232183 2.947138
H  -5.833274 1.68205 1.38807
H  -4.768594 2.801717 2.235198
H  -0.088053 1.396243 -2.294995
H  -0.776699 1.099644 -3.89304
H  -0.555337 -0.239473 -2.774834
H  -3.281958 0.395025 -4.061547
H  -4.290722 0.438796 -2.616394
H  -3.103518 -0.848089 -2.831049
H  -1.429656 -2.985028 0.995913
H  0.471642 -0.152629 -0.628384
H  0.464666 -3.322248 2.269742
H  2.711319 -2.61267 3.015475
H  3.826017 -0.689228 1.986302
H  3.781701 2.912561 1.033183
H  4.644519 -0.784425 -0.955138
H  6.194006 3.464051 1.049446
H  7.050557 -0.241003 -0.917505
H  7.83504 1.883218 0.081513
elementType: O N C H
totalener: -1285.32630021 hartree
nucrepener: 2740.79948199 hartree
electener: -4026.12578221 hartree
oneelecener: -7195.14233506 hartree
twoeener: 3169.01655286 hartree
cpcmener: -0.03702630 hartree
kineticenergy: 1279.67481832 hartree
xcener: -124.705419515113 hartree
chargesum: -0.0000000
charge: -0.457581 -0.264741 -0.443728 -0.325912 -0.087609 -0.117675 0.107513 -0.121496 0.136345 0.211478 -0.271949 -0.262335 0.398554 -0.282557 -0.274521 0.375072 0.028069 -0.229205 -0.238343 -0.175046 0.235722 -0.141039 -0.182792 0.245653 -0.218149 -0.179257 -0.134767 -0.146223 -0.165449 0.104451 0.093607 0.118659 0.099860 0.105463 0.078088 0.097042 0.088680 0.095528 0.092147 0.115866 0.084917 0.107363 0.100105 0.088533 0.128543 0.139880 0.143878 0.159488 0.154794 0.148762 0.159655 0.158250 0.159605 0.158806
qa: -0.4576 -0.2647 -0.4437 -0.3259 -0.0876 -0.1177 0.1075 -0.1215 0.1363 0.2115 -0.2719 -0.2623 0.3986 -0.2826 -0.2745 0.3751 0.0281 -0.2292 -0.2383 -0.1750 0.2357 -0.1410 -0.1828 0.2457 -0.2181 -0.1793 -0.1348 -0.1462 -0.1654 0.1045 0.0936 0.1187 0.0999 0.1055 0.0781 0.0970 0.0887 0.0955 0.0921 0.1159 0.0849 0.1074 0.1001 0.0885 0.1285 0.1399 0.1439 0.1595 0.1548 0.1488 0.1597 0.1582 0.1596 0.1588
va: 1.9415 2.1514 2.0642 2.0686 3.0859 3.8282 3.7847 3.9023 3.8730 3.7420 3.9158 3.9041 4.1169 3.9524 3.9609 3.7824 3.6728 4.0002 3.9757 3.9358 3.8820 3.9287 3.9046 3.7072 4.0018 3.9414 3.8887 3.8890 3.8917 1.0223 1.0286 0.9961 1.0015 1.0001 1.0079 1.0012 1.0055 1.0021 1.0086 1.0064 1.0087 1.0028 1.0021 1.0105 1.0259 1.0036 1.0007 0.9912 0.9978 1.0052 0.9951 0.9896 0.9900 0.9900
dispcorr: -0.030741730 hartree
energy: -1285.357041944675
dipole: -9.37900 10.81055 1.43154 11.98147 -11.27829 0.70318 2.75077 -0.19041 2.56036
magnitude: 3.01649 au
magnitude: 7.66730 debye
