program: Orca
programVersion: 5.0.2
elementType: O O O O N C C C C C C C C C C C C C C C C C C C C C C C C H H H H H H H H H H H H H H H H H H H H H H H H H
charge: 0
multiplicity: 1
keywords: wb97x-d3
keywords: def2-TZVPP
keywords: def2/J RIJCOSX
keywords: DEFGRID2
keywords: scfconv7
keywords: smallprint printgap noloewdin
keywords: NOSOSCF
formula: C24H25NO4
InChI: InChI=1/C24H25NO4/c1-23(2)19(21-24(3,4)29-21)20(23)22(26)28-18(14-25)15-9-8-12-17(13-15)27-16-10-6-5-7-11-16/h5-13,18-21H,1-4H3
54 atoms
O  -2.402237 2.913221 -1.619948
O  -2.163595 -1.926026 0.646088
O  -1.900234 0.134212 1.473903
O  2.817904 0.595679 0.603388
N  -1.107893 -4.912113 1.606566
C  -3.759821 1.069801 -0.711429
C  -4.745017 0.66851 0.329316
C  -3.663488 -0.31633 -0.084433
C  -2.70836 2.113389 -0.49171
C  -1.385856 2.057406 -1.119041
C  -4.746308 1.300631 1.699704
C  -6.133985 0.314608 -0.150522
C  -2.504536 -0.62727 0.766792
C  -0.230488 2.754753 -0.449962
C  -0.992976 0.908996 -2.010756
C  -0.960634 -2.32253 1.296891
C  0.245934 -1.929929 0.478806
C  -1.057057 -3.77424 1.460158
C  1.052843 -0.892347 0.914029
C  0.505163 -2.559083 -0.734115
C  2.119683 -0.468182 0.130329
C  1.571783 -2.130686 -1.504073
C  2.381003 -1.082817 -1.087295
C  4.095961 0.83013 0.174787
C  4.386176 2.082063 -0.34276
C  5.089387 -0.130986 0.308925
C  5.687136 2.376776 -0.723241
C  6.382567 0.172461 -0.08539
C  6.687164 1.424427 -0.601203
H  -4.124323 1.05331 -1.733688
H  -3.992507 -1.144642 -0.700436
H  -2.787689 2.669955 0.440798
H  -5.322096 2.227519 1.673656
H  -5.228676 0.636148 2.418249
H  -3.756932 1.532013 2.082526
H  -6.616584 -0.388417 0.530169
H  -6.122755 -0.137425 -1.142959
H  -6.756549 1.209286 -0.204309
H  -0.568527 3.581704 0.17388
H  0.462013 3.155859 -1.192831
H  0.320977 2.058469 0.181372
H  -0.34566 1.261364 -2.815902
H  -1.851382 0.417574 -2.465507
H  -0.432163 0.161996 -1.448453
H  -0.895767 -1.878425 2.295009
H  0.848292 -0.386351 1.848644
H  -0.116702 -3.376853 -1.075056
H  1.777356 -2.610854 -2.451244
H  3.200184 -0.751329 -1.711354
H  3.598061 2.817979 -0.434868
H  4.856448 -1.103467 0.723866
H  5.915916 3.35611 -1.121809
H  7.158629 -0.573732 0.021063
H  7.70002 1.656892 -0.900526
totalener: -1285.30281383 hartree
nucrepener: 2751.23991705 hartree
electener: -4036.54273088 hartree
oneelecener: -7216.06489745 hartree
twoeener: 3179.52216656 hartree
kineticenergy: 1279.74896621 hartree
xcener: -124.714917582871 hartree
chargesum: -0.0000000
charge: -0.382032 -0.255206 -0.392431 -0.295474 -0.001383 -0.117259 0.094772 -0.100541 0.114904 0.226868 -0.283483 -0.236768 0.333805 -0.252604 -0.215883 0.323039 0.019165 -0.259498 -0.189681 -0.158475 0.214023 -0.108781 -0.156644 0.217647 -0.186026 -0.161333 -0.102380 -0.118285 -0.130177 0.100065 0.084436 0.087304 0.097958 0.089676 0.100540 0.092680 0.074254 0.093006 0.085223 0.084553 0.083877 0.098450 0.094216 0.017905 0.117708 0.121992 0.120013 0.130375 0.136108 0.128732 0.135358 0.128619 0.129192 0.127885
qa: -0.3820 -0.2552 -0.3924 -0.2955 -0.0014 -0.1173 0.0948 -0.1005 0.1149 0.2269 -0.2835 -0.2368 0.3338 -0.2526 -0.2159 0.3230 0.0192 -0.2595 -0.1897 -0.1585 0.2140 -0.1088 -0.1566 0.2176 -0.1860 -0.1613 -0.1024 -0.1183 -0.1302 0.1001 0.0844 0.0873 0.0980 0.0897 0.1005 0.0927 0.0743 0.0930 0.0852 0.0846 0.0839 0.0985 0.0942 0.0179 0.1177 0.1220 0.1200 0.1304 0.1361 0.1287 0.1354 0.1286 0.1292 0.1279
va: 2.0359 2.1363 2.0940 2.0829 3.1210 3.8251 3.7804 3.8663 4.0029 3.8445 3.9157 3.8998 4.1509 3.9467 3.9361 3.8386 3.6206 4.0217 3.9666 4.0001 3.8256 3.9642 3.9323 3.8327 4.0195 3.9691 3.9437 3.9471 3.9510 1.0213 1.0322 1.0008 0.9980 1.0034 1.0197 1.0045 1.0077 1.0038 1.0163 1.0048 1.0080 1.0107 1.0105 1.0284 1.0195 1.0318 1.0178 1.0013 1.0058 1.0097 1.0034 0.9996 0.9996 0.9998
dispcorr: -0.031433366 hartree
energy: -1285.334247198286
dipole: -12.38019 12.92065 0.54046 14.70863 -14.05482 0.65381 -6.70913 6.20688 -0.50224
magnitude: 0.98581 au
magnitude: 2.50572 debye
