program: Orca
programVersion: 5.0.2
elementType: O O O O N C C C C C C C C C C C C C C C C C C C C C C C C H H H H H H H H H H H H H H H H H H H H H H H H H
charge: 0
multiplicity: 1
keywords: wb97x-d3
keywords: def2-TZVPP
keywords: def2/J RIJCOSX
keywords: DEFGRID2
keywords: scfconv7
keywords: smallprint printgap noloewdin
keywords: NOSOSCF
formula: C24H25NO4
InChI: InChI=1/C24H25NO4/c1-23(2)19(21-24(3,4)29-21)20(23)22(26)28-18(14-25)15-9-8-12-17(13-15)27-16-10-6-5-7-11-16/h5-13,18-21H,1-4H3
54 atoms
O  -3.172288 3.164714 -1.073766
O  -1.13913 -1.600148 0.222981
O  -2.571864 -0.246639 1.277121
O  3.451516 1.015705 0.073763
N  0.946823 -3.958308 1.240837
C  -3.384222 0.739314 -1.462121
C  -4.26437 -0.452677 -1.326125
C  -2.771665 -0.605066 -1.085012
C  -3.400946 1.889099 -0.503212
C  -2.201906 2.66026 -0.167656
C  -5.257433 -0.574312 -0.196385
C  -4.76043 -1.083424 -2.607411
C  -2.19931 -0.768554 0.260358
C  -2.134025 3.357688 1.165363
C  -0.860468 2.31819 -0.760911
C  -0.398186 -1.726141 1.430642
C  0.527322 -0.550076 1.631349
C  0.348469 -2.980436 1.308563
C  1.583366 -0.357971 0.747315
C  0.290175 0.353245 2.655321
C  2.417354 0.73968 0.907014
C  1.125096 1.452738 2.798448
C  2.187394 1.648686 1.935438
C  4.067887 0.009166 -0.620781
C  4.55103 -1.125299 0.018508
C  4.247465 0.184788 -1.983578
C  5.20926 -2.092191 -0.724241
C  4.920285 -0.78463 -2.71274
C  5.397426 -1.927219 -2.08929
H  -3.158967 1.044174 -2.479229
H  -2.218174 -1.115896 -1.863974
H  -4.197995 1.870719 0.2382
H  -4.917607 -0.147388 0.742206
H  -6.187895 -0.076581 -0.474986
H  -5.49012 -1.624451 -0.013239
H  -4.963048 -2.14644 -2.467689
H  -4.038663 -0.986527 -3.419202
H  -5.686327 -0.605831 -2.931901
H  -3.127104 3.58499 1.551807
H  -1.580445 4.295224 1.086728
H  -1.622493 2.725261 1.891271
H  -0.27611 3.226055 -0.921233
H  -0.942011 1.80326 -1.716755
H  -0.291393 1.68409 -0.08012
H  -1.069831 -1.818861 2.289757
H  1.755072 -1.064533 -0.055997
H  -0.545073 0.209267 3.32698
H  0.947248 2.163106 3.594601
H  2.844105 2.501312 2.047143
H  4.414233 -1.2560 1.084466
H  3.867998 1.07787 -2.462395
H  5.580338 -2.979044 -0.228309
H  5.063674 -0.646279 -3.776221
H  5.91446 -2.684982 -2.662019
totalener: -1285.30255021 hartree
nucrepener: 2766.84012489 hartree
electener: -4052.14267511 hartree
oneelecener: -7247.39685332 hartree
twoeener: 3195.25417821 hartree
kineticenergy: 1279.74713942 hartree
xcener: -124.714752888890 hartree
chargesum: -0.0000000
charge: -0.380108 -0.260471 -0.388549 -0.296951 -0.002270 -0.115633 0.092406 -0.090801 0.114712 0.215517 -0.281961 -0.236879 0.321013 -0.240559 -0.212427 0.347890 0.011363 -0.269035 -0.183158 -0.160647 0.235911 -0.100468 -0.199584 0.243256 -0.171352 -0.205025 -0.099952 -0.093384 -0.139660 0.099625 0.084604 0.087173 0.099517 0.098044 0.089838 0.092452 0.074573 0.092858 0.083037 0.088674 0.077108 0.100332 0.091972 0.013776 0.119581 0.129430 0.120232 0.132219 0.129631 0.133271 0.125379 0.130025 0.126326 0.127132
qa: -0.3801 -0.2605 -0.3885 -0.2970 -0.0023 -0.1156 0.0924 -0.0908 0.1147 0.2155 -0.2820 -0.2369 0.3210 -0.2406 -0.2124 0.3479 0.0114 -0.2690 -0.1832 -0.1606 0.2359 -0.1005 -0.1996 0.2433 -0.1714 -0.2050 -0.1000 -0.0934 -0.1397 0.0996 0.0846 0.0872 0.0995 0.0980 0.0898 0.0925 0.0746 0.0929 0.0830 0.0887 0.0771 0.1003 0.0920 0.0138 0.1196 0.1294 0.1202 0.1322 0.1296 0.1333 0.1254 0.1300 0.1263 0.1271
va: 2.0381 2.1366 2.0997 2.1145 3.1200 3.8259 3.7840 3.8554 4.0039 3.8551 3.9145 3.8992 4.1639 3.9356 3.9287 3.8308 3.6193 4.0297 3.9142 3.9306 3.8241 3.9145 4.0151 3.7985 3.9667 4.0471 3.9460 3.9321 3.9614 1.0211 1.0320 1.0014 1.0201 0.9983 1.0033 1.0044 1.0075 1.0040 1.0161 1.0061 1.0102 1.0103 1.0107 1.0344 1.0193 1.0188 1.0192 0.9983 1.0119 1.0039 1.0133 0.9996 0.9991 1.0002
dispcorr: -0.031170616 hartree
energy: -1285.333720828804
dipole: -18.81211 18.67068 -0.14143 8.79331 -8.52460 0.26871 -7.27177 7.13223 -0.13953
magnitude: 0.33418 au
magnitude: 0.84942 debye
