program: Orca
programVersion: 5.0.2
elementType: O O O N C C C C C C C C C C C C C C C C C C C C C C C C H H H H H H H H H H H H H H H H H H H H H H H H H
charge: 0
multiplicity: 1
keywords: wb97x-d3
keywords: def2-TZVPP
keywords: def2/J RIJCOSX
keywords: DEFGRID2
keywords: scfconv7
keywords: smallprint printgap noloewdin
keywords: NOSOSCF
formula: C24H25NO3
InChI: InChI=1/C24H25NO3/c1-16(2)13-20-22(24(20,3)4)23(26)28-21(15-25)17-9-8-12-19(14-17)27-18-10-6-5-7-11-18/h5-14,20-22H,1-4H3
53 atoms
O  -0.725829 1.458017 -0.180453
O  -1.288334 1.155455 1.952535
O  -1.592491 -3.56073 -0.42692
N  -3.510789 3.240765 0.538716
C  2.131216 0.691483 0.699364
C  2.006053 2.177732 0.581803
C  1.005781 1.408199 1.432657
C  1.873256 -0.15241 -0.52439
C  3.194649 0.099334 1.592229
C  2.927205 3.115528 1.255563
C  -0.425393 1.316739 1.122425
C  3.574757 4.137445 0.686028
C  3.488256 4.509436 -0.762391
C  4.477756 5.016768 1.497215
C  -2.084988 1.338388 -0.55604
C  -2.666628 -0.049354 -0.357883
C  -2.884634 2.386252 0.09111
C  -1.82618 -1.150365 -0.482932
C  -4.024737 -0.226421 -0.138153
C  -2.353403 -2.429216 -0.368181
C  -4.537185 -1.513238 -0.035085
C  -3.712943 -2.617869 -0.146276
C  -0.312172 -3.517868 -0.933641
C  -0.077884 -3.151989 -2.252371
C  0.726212 -3.916364 -0.107004
C  1.21969 -3.186117 -2.741744
C  2.018796 -3.95939 -0.613571
C  2.270157 -3.591535 -1.927488
H  1.620567 2.5078 -0.376263
H  1.159407 1.479979 2.503782
H  1.441651 -1.116457 -0.250142
H  1.222022 0.323964 -1.253243
H  2.822649 -0.35277 -1.024543
H  4.152434 0.065492 1.069683
H  3.33726 0.659549 2.514999
H  2.930542 -0.924005 1.864939
H  3.084795 2.947491 2.317025
H  4.483941 4.508566 -1.212622
H  2.860527 3.846155 -1.353423
H  3.102565 5.5254 -0.876885
H  4.159864 6.060861 1.442023
H  4.502233 4.727034 2.546998
H  5.500538 4.986538 1.113751
H  -2.0887 1.569852 -1.624769
H  -0.768951 -1.014359 -0.663133
H  -4.692884 0.619952 -0.04691
H  -5.595821 -1.654378 0.136364
H  -4.113926 -3.619364 -0.058068
H  -0.896964 -2.848962 -2.892636
H  0.524975 -4.197842 0.918702
H  1.407018 -2.902379 -3.768963
H  2.831052 -4.274867 0.027723
H  3.27885 -3.620961 -2.317165
elementType: O N C H
totalener: -1210.09068391 hartree
nucrepener: 2560.79317598 hartree
electener: -3770.88385989 hartree
oneelecener: -6732.74067252 hartree
twoeener: 2961.85681263 hartree
cpcmener: -0.04176515 hartree
kineticenergy: 1204.69097265 hartree
xcener: -118.589497071758 hartree
chargesum: -0.0000000
charge: -0.286014 -0.464264 -0.334394 -0.094438 0.159173 0.064023 -0.127904 -0.306988 -0.280727 -0.306939 0.427281 -0.040777 -0.252093 -0.222088 0.465872 -0.059532 -0.236843 -0.202560 -0.219749 0.308367 -0.102081 -0.258546 0.251939 -0.174228 -0.185259 -0.149129 -0.150788 -0.172511 0.105711 0.090114 0.058514 0.104182 0.115381 0.098088 0.092391 0.097112 0.123482 0.095920 0.088848 0.097505 0.093813 0.089019 0.094588 0.145815 0.128704 0.136195 0.161246 0.148055 0.158045 0.147121 0.160427 0.159948 0.160976
qa: -0.2860 -0.4643 -0.3344 -0.0944 0.1592 0.0640 -0.1279 -0.3070 -0.2807 -0.3069 0.4273 -0.0408 -0.2521 -0.2221 0.4659 -0.0595 -0.2368 -0.2026 -0.2197 0.3084 -0.1021 -0.2585 0.2519 -0.1742 -0.1853 -0.1491 -0.1508 -0.1725 0.1057 0.0901 0.0585 0.1042 0.1154 0.0981 0.0924 0.0971 0.1235 0.0959 0.0888 0.0975 0.0938 0.0890 0.0946 0.1458 0.1287 0.1362 0.1612 0.1481 0.1580 0.1471 0.1604 0.1599 0.1610
va: 2.1304 2.0324 2.0817 3.1020 3.6304 3.7585 3.9207 3.9015 3.9149 3.8616 4.1307 3.7555 3.9438 3.9220 3.8073 3.8405 4.1158 3.9252 3.9552 3.7059 3.9150 4.0041 3.6910 3.9045 3.9380 3.8533 3.8536 3.8431 1.0222 1.0348 1.0106 1.0112 0.9985 1.0018 1.0063 1.0015 1.0101 0.9974 1.0105 0.9966 0.9960 1.0089 0.9962 0.9902 1.0137 1.0148 0.9885 1.0078 0.9956 1.0051 0.9901 0.9901 0.9903
dispcorr: -0.028973306 hartree
energy: -1210.119657219107
dipole: 33.83603 -31.27641 2.55961 12.20622 -13.20669 -1.00047 -0.65455 -1.45076 -2.10531
magnitude: 3.46192 au
magnitude: 8.79951 debye
