program: Orca
programVersion: 5.0.2
elementType: O O O N C C C C C C C C C C C C C C C C C C C C C C C C H H H H H H H H H H H H H H H H H H H H H H H H H
charge: 0
multiplicity: 1
keywords: wb97x-d3
keywords: def2-TZVPP
keywords: def2/J RIJCOSX
keywords: DEFGRID2
keywords: scfconv7
keywords: smallprint printgap noloewdin
keywords: NOSOSCF
formula: C24H25NO3
InChI: InChI=1/C24H25NO3/c1-16(2)13-20-22(24(20,3)4)23(26)28-21(15-25)17-9-8-12-19(14-17)27-18-10-6-5-7-11-18/h5-14,20-22H,1-4H3
53 atoms
O  -0.661902 1.538929 -0.15863
O  -1.183839 3.605818 0.496916
O  -0.516414 -3.485498 0.268254
N  -2.529561 1.315826 2.671798
C  1.536824 4.366687 -0.892357
C  1.742887 4.221775 0.572332
C  1.057001 3.099386 -0.192713
C  0.54753 5.382426 -1.407487
C  2.714575 4.167244 -1.815525
C  3.083132 3.991559 1.170533
C  -0.356317 2.830201 0.080288
C  3.33333 3.1696 2.193188
C  2.280134 2.341292 2.863838
C  4.717913 3.002952 2.739996
C  -1.992787 1.131893 0.114738
C  -2.153601 -0.309114 -0.298948
C  -2.27457 1.259489 1.551288
C  -1.237147 -1.262627 0.128234
C  -3.238307 -0.673539 -1.08255
C  -1.421924 -2.589568 -0.227403
C  -3.413902 -2.007893 -1.422736
C  -2.516291 -2.97252 -0.99687
C  -0.197333 -4.616311 -0.445644
C  0.069664 -4.573868 -1.808433
C  -0.086953 -5.801966 0.265017
C  0.437707 -5.741812 -2.460388
C  0.296875 -6.959532 -0.397944
C  0.553261 -6.936784 -1.761815
H  1.056799 4.805672 1.181961
H  1.653637 2.215477 -0.385058
H  -0.236495 5.620966 -0.693134
H  1.071517 6.312417 -1.635343
H  0.076024 5.038139 -2.329545
H  2.375261 3.880359 -2.812076
H  3.28098 5.095247 -1.914784
H  3.398959 3.395494 -1.463611
H  3.908023 4.556734 0.74521
H  2.359644 2.424851 3.949982
H  1.265667 2.618581 2.582937
H  2.414947 1.282273 2.626848
H  5.451111 3.595363 2.193282
H  4.761125 3.295311 3.792064
H  5.028768 1.955867 2.698557
H  -2.714776 1.753972 -0.422681
H  -0.388149 -0.988408 0.743339
H  -3.943845 0.074691 -1.419406
H  -4.263056 -2.302819 -2.024201
H  -2.676063 -4.009831 -1.260629
H  -0.005134 -3.64522 -2.360131
H  -0.293075 -5.816878 1.327649
H  0.641415 -5.711853 -3.522664
H  0.38704 -7.883733 0.157554
H  0.844098 -7.842372 -2.277023
elementType: O N C H
totalener: -1210.09285044 hartree
nucrepener: 2417.50664760 hartree
electener: -3627.59949804 hartree
oneelecener: -6446.59308379 hartree
twoeener: 2818.99358575 hartree
cpcmener: -0.03731572 hartree
kineticenergy: 1204.69049945 hartree
xcener: -118.580949468338 hartree
chargesum: 0.0000000
charge: -0.290508 -0.477485 -0.335927 -0.107882 0.147547 -0.005573 -0.105159 -0.280076 -0.282702 -0.307463 0.404668 -0.008623 -0.239120 -0.228843 0.444339 -0.009086 -0.230173 -0.233088 -0.187369 0.243010 -0.140785 -0.178032 0.283453 -0.193703 -0.246465 -0.147429 -0.127533 -0.184930 0.106175 0.098064 0.092303 0.096363 0.102070 0.098294 0.100018 0.094336 0.124660 0.102052 0.079700 0.104006 0.090255 0.096836 0.095171 0.132370 0.141931 0.149930 0.164212 0.159448 0.160792 0.149148 0.163109 0.161412 0.162284
qa: -0.2905 -0.4775 -0.3359 -0.1079 0.1475 -0.0056 -0.1052 -0.2801 -0.2827 -0.3075 0.4047 -0.0086 -0.2391 -0.2288 0.4443 -0.0091 -0.2302 -0.2331 -0.1874 0.2430 -0.1408 -0.1780 0.2835 -0.1937 -0.2465 -0.1474 -0.1275 -0.1849 0.1062 0.0981 0.0923 0.0964 0.1021 0.0983 0.1000 0.0943 0.1247 0.1021 0.0797 0.1040 0.0903 0.0968 0.0952 0.1324 0.1419 0.1499 0.1642 0.1594 0.1608 0.1491 0.1631 0.1614 0.1623
va: 2.1495 2.0198 2.0671 3.1052 3.7012 3.8090 3.8463 3.8920 3.9111 3.8964 4.1103 3.7057 3.9368 3.9316 3.7036 3.7519 4.0197 4.0729 3.9512 3.8017 3.9098 3.9043 3.6712 3.9123 4.0054 3.8851 3.8811 3.8964 1.0241 1.0262 1.0169 1.0009 0.9989 1.0031 0.9999 1.0019 1.0035 1.0003 1.0121 0.9977 1.0059 0.9965 0.9961 1.0209 1.0260 1.0017 0.9900 0.9944 0.9949 1.0068 0.9892 0.9881 0.9890
dispcorr: -0.024734595 hartree
energy: -1210.117585036988
dipole: 24.19163 -23.11453 1.07710 18.59410 -19.76689 -1.17279 -2.47731 -0.15850 -2.63582
magnitude: 3.07947 au
magnitude: 7.82739 debye
