program: Orca
programVersion: 5.0.2
elementType: O O O N C C C C C C C C C C C C C C C C C C C C C C C C H H H H H H H H H H H H H H H H H H H H H H H H H
charge: 0
multiplicity: 1
keywords: wb97x-d3
keywords: def2-TZVPP
keywords: def2/J RIJCOSX
keywords: DEFGRID2
keywords: scfconv7
keywords: smallprint printgap noloewdin
keywords: NOSOSCF
formula: C24H25NO3
InChI: InChI=1/C24H25NO3/c1-16(2)13-20-22(24(20,3)4)23(26)28-21(15-25)17-9-8-12-19(14-17)27-18-10-6-5-7-11-18/h5-14,20-22H,1-4H3
53 atoms
O  -0.637136 1.645492 -0.247422
O  -1.157714 3.546191 0.800557
O  0.024972 -3.279645 -0.754033
N  -1.952979 0.844153 2.767343
C  1.319802 4.691563 -0.787448
C  1.73359 4.315645 0.589565
C  0.981529 3.302608 -0.259565
C  0.239125 5.726463 -0.97633
C  2.355939 4.71067 -1.884467
C  3.145549 4.046625 0.963751
C  -0.364742 2.903322 0.153892
C  3.53889 3.065148 1.7795
C  2.593291 2.083724 2.403117
C  4.983415 2.85927 2.116041
C  -1.875262 1.08496 0.160049
C  -1.989607 -0.286755 -0.455477
C  -1.91537 0.975762 1.624948
C  -0.952205 -1.199153 -0.299179
C  -3.132949 -0.633128 -1.158995
C  -1.059068 -2.454248 -0.874128
C  -3.229668 -1.900409 -1.71931
C  -2.197349 -2.814176 -1.589199
C  -0.154127 -4.631191 -0.580882
C  0.695439 -5.475569 -1.27995
C  -1.097626 -5.139928 0.302853
C  0.601781 -6.846865 -1.087782
C  -1.186867 -6.513652 0.476268
C  -0.341453 -7.371606 -0.214995
H  1.121902 4.755759 1.374314
H  1.577108 2.498779 -0.676082
H  -0.446262 5.790003 -0.134089
H  0.69927 6.709183 -1.096739
H  -0.343922 5.524855 -1.876784
H  1.882802 4.575748 -2.858531
H  2.876277 5.670114 -1.900568
H  3.104556 3.92704 -1.768936
H  3.896549 4.715399 0.552244
H  2.830409 1.939851 3.459322
H  1.549315 2.384168 2.336891
H  2.689113 1.102652 1.929447
H  5.631771 3.56771 1.601194
H  5.152697 2.962268 3.190658
H  5.304905 1.849171 1.849371
H  -2.717196 1.708692 -0.154357
H  -0.06054 -0.942832 0.260905
H  -3.939942 0.078761 -1.27455
H  -4.115131 -2.17611 -2.27587
H  -2.279178 -3.791143 -2.047906
H  1.427271 -5.062032 -1.962188
H  -1.752928 -4.47896 0.856065
H  1.26758 -7.505307 -1.629988
H  -1.921002 -6.912711 1.163743
H  -0.415188 -8.441114 -0.071077
elementType: O N C H
totalener: -1210.09277556 hartree
nucrepener: 2420.55509264 hartree
electener: -3630.64786820 hartree
oneelecener: -6452.78858274 hartree
twoeener: 2822.14071455 hartree
cpcmener: -0.03697504 hartree
kineticenergy: 1204.69744642 hartree
xcener: -118.581531431963 hartree
chargesum: 0.0000000
charge: -0.287352 -0.477168 -0.338575 -0.107505 0.148926 -0.002197 -0.105731 -0.280789 -0.282132 -0.312306 0.399576 -0.007525 -0.239532 -0.228798 0.445497 -0.006817 -0.231092 -0.227208 -0.186203 0.222037 -0.138946 -0.167553 0.270446 -0.242577 -0.180261 -0.130392 -0.151954 -0.182075 0.106949 0.097571 0.092108 0.096653 0.100939 0.098491 0.100217 0.094101 0.125787 0.102704 0.079031 0.105062 0.090076 0.096988 0.095163 0.132504 0.143598 0.150360 0.164324 0.160242 0.149526 0.160092 0.161215 0.162835 0.161671
qa: -0.2874 -0.4772 -0.3386 -0.1075 0.1489 -0.0022 -0.1057 -0.2808 -0.2821 -0.3123 0.3996 -0.0075 -0.2395 -0.2288 0.4455 -0.0068 -0.2311 -0.2272 -0.1862 0.2220 -0.1389 -0.1676 0.2704 -0.2426 -0.1803 -0.1304 -0.1520 -0.1821 0.1069 0.0976 0.0921 0.0967 0.1009 0.0985 0.1002 0.0941 0.1258 0.1027 0.0790 0.1051 0.0901 0.0970 0.0952 0.1325 0.1436 0.1504 0.1643 0.1602 0.1495 0.1601 0.1612 0.1628 0.1617
va: 2.1477 2.0201 2.0592 3.1025 3.7027 3.8035 3.8441 3.8931 3.9092 3.8990 4.1188 3.7030 3.9384 3.9324 3.7085 3.7418 4.0205 4.0770 3.9497 3.8104 3.9047 3.9089 3.6830 4.0003 3.8996 3.8850 3.8874 3.8923 1.0237 1.0269 1.0167 1.0004 0.9994 1.0030 0.9999 1.0021 1.0035 1.0005 1.0121 0.9975 1.0059 0.9964 0.9960 1.0195 1.0255 1.0015 0.9898 0.9937 1.0066 0.9958 0.9882 0.9893 0.9891
dispcorr: -0.024983186 hartree
energy: -1210.117758746617
dipole: 21.56844 -21.12262 0.44581 19.40909 -20.29783 -0.88874 -1.26924 -1.08199 -2.35124
magnitude: 2.55283 au
magnitude: 6.48877 debye
