program: Orca
programVersion: 5.0.2
elementType: O O O N C C C C C C C C C C C C C C C C C C C C C C C C H H H H H H H H H H H H H H H H H H H H H H H H H
charge: 0
multiplicity: 1
keywords: wb97x-d3
keywords: def2-TZVPP
keywords: def2/J RIJCOSX
keywords: DEFGRID2
keywords: scfconv7
keywords: smallprint printgap noloewdin
keywords: NOSOSCF
formula: C24H25NO3
InChI: InChI=1/C24H25NO3/c1-16(2)13-20-22(24(20,3)4)23(26)28-21(15-25)17-9-8-12-19(14-17)27-18-10-6-5-7-11-18/h5-14,20-22H,1-4H3
53 atoms
O  -1.144555 1.783099 0.204317
O  -1.326344 1.883988 -2.015649
O  -1.4033 -3.339574 0.118552
N  -3.143763 1.685534 2.815926
C  1.450714 3.38833 -0.223984
C  1.739189 1.953811 0.098616
C  0.79242 2.287886 -1.042486
C  0.653013 4.206133 0.762298
C  2.478709 4.213859 -0.95945
C  3.027402 1.309229 -0.224376
C  -0.642811 1.97653 -1.023694
C  3.750616 0.526164 0.583363
C  3.368492 0.148003 1.981167
C  5.049657 -0.057349 0.115354
C  -2.51981 1.441808 0.289272
C  -2.796648 0.031185 -0.17702
C  -2.853086 1.582642 1.708013
C  -1.940804 -0.993703 0.204397
C  -3.90419 -0.226177 -0.971359
C  -2.193164 -2.282162 -0.243013
C  -4.158239 -1.526034 -1.384574
C  -3.300961 -2.556552 -1.033636
C  -0.036288 -3.202543 0.139687
C  0.652853 -2.478846 -0.826368
C  0.644073 -3.879404 1.14173
C  2.039497 -2.439687 -0.779083
C  2.030798 -3.841648 1.168315
C  2.733593 -3.122603 0.211409
H  1.252432 1.600048 1.000098
H  1.201262 2.175145 -2.040664
H  1.338513 4.766032 1.400932
H  0.018983 4.931613 0.249036
H  0.023929 3.607583 1.417045
H  3.2233 4.601351 -0.261447
H  3.004943 3.654367 -1.731138
H  2.002457 5.069159 -1.441856
H  3.416636 1.499229 -1.22035
H  2.486678 0.664486 2.354398
H  3.177499 -0.926869 2.046222
H  4.189964 0.355477 2.670977
H  5.880019 0.293915 0.733523
H  5.045707 -1.146924 0.200548
H  5.268187 0.199502 -0.920835
H  -3.141758 2.152168 -0.265132
H  -1.086588 -0.792698 0.840146
H  -4.561031 0.581261 -1.268086
H  -5.019404 -1.736609 -2.004093
H  -3.487082 -3.568392 -1.369962
H  0.124809 -1.956357 -1.613858
H  0.092267 -4.437347 1.887487
H  2.57872 -1.878181 -1.53094
H  2.561659 -4.374684 1.946054
H  3.814598 -3.095268 0.23613
elementType: O N C H
totalener: -1210.09193039 hartree
nucrepener: 2600.00418218 hartree
electener: -3810.09611257 hartree
oneelecener: -6811.16809571 hartree
twoeener: 3001.07198314 hartree
cpcmener: -0.03778190 hartree
kineticenergy: 1204.70331226 hartree
xcener: -118.587147361216 hartree
chargesum: 0.0000000
charge: -0.278760 -0.471261 -0.339762 -0.100323 0.102838 0.086704 -0.110964 -0.272850 -0.273323 -0.315854 0.420635 -0.070724 -0.247032 -0.219269 0.391426 0.026355 -0.224408 -0.178930 -0.211885 0.232315 -0.116380 -0.230459 0.296441 -0.185885 -0.258136 -0.144602 -0.110242 -0.229068 0.104543 0.090977 0.096182 0.102315 0.090443 0.097741 0.089871 0.098617 0.121698 0.091693 0.093057 0.101809 0.104442 0.087673 0.091565 0.147336 0.153109 0.150144 0.162716 0.151381 0.155174 0.148674 0.163894 0.160217 0.178134
qa: -0.2788 -0.4713 -0.3398 -0.1003 0.1028 0.0867 -0.1110 -0.2729 -0.2733 -0.3159 0.4206 -0.0707 -0.2470 -0.2193 0.3914 0.0264 -0.2244 -0.1789 -0.2119 0.2323 -0.1164 -0.2305 0.2964 -0.1859 -0.2581 -0.1446 -0.1102 -0.2291 0.1045 0.0910 0.0962 0.1023 0.0904 0.0977 0.0899 0.0986 0.1217 0.0917 0.0931 0.1018 0.1044 0.0877 0.0916 0.1473 0.1531 0.1501 0.1627 0.1514 0.1552 0.1487 0.1639 0.1602 0.1781
va: 2.1198 2.0320 2.0673 3.1060 3.7171 3.6972 3.8732 3.9132 3.9152 3.8270 4.1261 3.7663 3.9262 3.9075 3.7462 3.5841 4.0815 3.9269 3.9786 3.7641 3.8906 4.0067 3.6676 3.8955 4.0171 3.8341 3.8638 3.8556 1.0186 1.0328 1.0002 0.9995 1.0099 1.0015 1.0067 1.0013 1.0111 1.0101 1.0003 0.9995 0.9981 0.9987 1.0083 1.0147 1.0092 1.0010 0.9877 1.0033 1.0006 1.0071 0.9904 0.9891 0.9777
dispcorr: -0.029982368 hartree
energy: -1210.121912760899
dipole: 31.23528 -29.70468 1.53060 11.57988 -11.37720 0.20268 0.73178 -1.51037 -0.77859
magnitude: 1.72917 au
magnitude: 4.39519 debye
