program: Orca
programVersion: 5.0.2
elementType: O O O N C C C C C C C C C C C C C C C C C C C C C C C C H H H H H H H H H H H H H H H H H H H H H H H H H
charge: 0
multiplicity: 1
keywords: wb97x-d3
keywords: def2-TZVPP
keywords: def2/J RIJCOSX
keywords: DEFGRID2
keywords: scfconv7
keywords: smallprint printgap noloewdin
keywords: NOSOSCF
formula: C24H25NO3
InChI: InChI=1/C24H25NO3/c1-16(2)13-20-22(24(20,3)4)23(26)28-21(15-25)17-9-8-12-19(14-17)27-18-10-6-5-7-11-18/h5-14,20-22H,1-4H3
53 atoms
O  -1.171462 1.778954 0.196112
O  -1.366168 2.000253 -2.013682
O  -1.411607 -3.35525 0.123061
N  -3.185241 1.638338 2.795743
C  1.454651 3.326346 -0.093768
C  1.725897 1.859201 0.031495
C  0.75845 2.351121 -1.031872
C  0.704485 4.023555 1.015194
C  2.489915 4.21399 -0.742393
C  2.995543 1.239272 -0.404562
C  -0.676568 2.038603 -1.022141
C  3.822606 0.523571 0.364025
C  3.601135 0.243811 1.818402
C  5.071205 -0.077138 -0.206852
C  -2.543973 1.424604 0.270733
C  -2.801849 0.014831 -0.208508
C  -2.886559 1.547979 1.688858
C  -1.950626 -1.008058 0.190354
C  -3.890037 -0.244963 -1.028282
C  -2.191522 -2.297901 -0.259513
C  -4.131117 -1.545677 -1.44739
C  -3.280809 -2.574284 -1.075358
C  -0.046798 -3.208231 0.198721
C  0.675615 -2.535305 -0.779259
C  0.596089 -3.8208 1.264248
C  2.05887 -2.483117 -0.680877
C  1.980781 -3.768864 1.344026
C  2.716692 -3.101018 0.375278
H  1.255111 1.397401 0.89227
H  1.145498 2.361389 -2.044969
H  0.064026 4.81533 0.622281
H  0.090809 3.354561 1.613382
H  1.422149 4.491294 1.691664
H  2.982806 3.742192 -1.591352
H  2.030379 5.137747 -1.098001
H  3.260501 4.486105 -0.018647
H  3.268034 1.38479 -1.446012
H  3.46373 -0.82737 1.988276
H  4.479835 0.536213 2.39821
H  2.742062 0.761341 2.240066
H  5.088716 -1.159982 -0.057425
H  5.171344 0.117364 -1.274419
H  5.959917 0.315113 0.294259
H  -3.170593 2.133061 -0.280731
H  -1.111615 -0.804184 0.845208
H  -4.542924 0.560654 -1.338397
H  -4.97696 -1.758432 -2.086922
H  -3.458553 -3.586983 -1.413696
H  0.17427 -2.064541 -1.615449
H  0.018243 -4.338664 2.019129
H  2.624387 -1.963593 -1.44348
H  2.483372 -4.249989 2.172719
H  3.795797 -3.062795 0.441483
elementType: O N C H
totalener: -1210.09183631 hartree
nucrepener: 2598.41087698 hartree
electener: -3808.50271329 hartree
oneelecener: -6807.96372232 hartree
twoeener: 2999.46100903 hartree
cpcmener: -0.03757568 hartree
kineticenergy: 1204.70111404 hartree
xcener: -118.585996429427 hartree
chargesum: -0.0000000
charge: -0.277739 -0.472518 -0.340930 -0.100355 0.136496 0.068133 -0.131763 -0.281327 -0.269403 -0.319306 0.421669 -0.055614 -0.249453 -0.223617 0.392406 0.019657 -0.225805 -0.165041 -0.209826 0.221945 -0.117866 -0.228460 0.286924 -0.181452 -0.254990 -0.147071 -0.111277 -0.223742 0.103763 0.090387 0.102697 0.089793 0.095329 0.089870 0.099436 0.097111 0.123079 0.093156 0.102956 0.091608 0.088661 0.093195 0.104853 0.146703 0.154866 0.150658 0.162652 0.151577 0.156153 0.148934 0.165373 0.160624 0.176891
qa: -0.2777 -0.4725 -0.3409 -0.1004 0.1365 0.0681 -0.1318 -0.2813 -0.2694 -0.3193 0.4217 -0.0556 -0.2495 -0.2236 0.3924 0.0197 -0.2258 -0.1650 -0.2098 0.2219 -0.1179 -0.2285 0.2869 -0.1815 -0.2550 -0.1471 -0.1113 -0.2237 0.1038 0.0904 0.1027 0.0898 0.0953 0.0899 0.0994 0.0971 0.1231 0.0932 0.1030 0.0916 0.0887 0.0932 0.1049 0.1467 0.1549 0.1507 0.1627 0.1516 0.1562 0.1489 0.1654 0.1606 0.1769
va: 2.1206 2.0322 2.0635 3.1062 3.6935 3.7004 3.9162 3.9166 3.9137 3.8171 4.1250 3.7419 3.9288 3.9087 3.7501 3.5943 4.0809 3.9174 3.9753 3.7746 3.8932 4.0043 3.6706 3.9056 4.0190 3.8407 3.8767 3.8545 1.0167 1.0346 0.9996 1.0094 1.0006 1.0050 1.0018 1.0022 1.0097 1.0014 0.9991 1.0084 0.9975 1.0075 0.9988 1.0154 1.0074 1.0007 0.9878 1.0033 0.9994 1.0068 0.9884 0.9890 0.9785
dispcorr: -0.030036300 hartree
energy: -1210.121872605541
dipole: 31.95183 -30.32444 1.62739 11.36192 -11.23286 0.12906 0.87229 -1.59844 -0.72615
magnitude: 1.78671 au
magnitude: 4.54146 debye
