program: Orca
programVersion: 5.0.2
elementType: O O O N C C C C C C C C C C C C C C C C C C C C C C C C H H H H H H H H H H H H H H H H H H H H H H H H H
charge: 0
multiplicity: 1
keywords: wb97x-d3
keywords: def2-TZVPP
keywords: def2/J RIJCOSX
keywords: DEFGRID2
keywords: scfconv7
keywords: smallprint printgap noloewdin
keywords: NOSOSCF
formula: C24H25NO3
InChI: InChI=1/C24H25NO3/c1-16(2)13-20-22(24(20,3)4)23(26)28-21(15-25)17-9-8-12-19(14-17)27-18-10-6-5-7-11-18/h5-14,20-22H,1-4H3
53 atoms
O  -1.028894 2.012975 0.350217
O  0.729128 1.657226 -0.982382
O  -1.111121 -3.546776 -1.777911
N  -4.262157 1.36217 0.27027
C  2.234308 2.829633 1.533314
C  2.184592 3.863673 0.452123
C  0.906456 3.175609 0.866823
C  2.914371 1.513602 1.249991
C  2.377662 3.278744 2.965483
C  2.334009 5.313167 0.735944
C  0.247652 2.22161 -0.03161
C  3.457226 6.014386 0.561657
C  4.739331 5.417966 0.068651
C  3.510082 7.48272 0.854495
C  -1.750474 1.031776 -0.373959
C  -1.319231 -0.380329 -0.043244
C  -3.15129 1.22871 0.003746
C  -1.406707 -1.348921 -1.030946
C  -0.887167 -0.711273 1.234642
C  -1.049643 -2.658445 -0.741553
C  -0.519956 -2.021207 1.502953
C  -0.593868 -3.001867 0.524928
C  -1.39723 -4.870953 -1.547828
C  -2.41604 -5.266855 -0.690355
C  -0.667227 -5.806513 -2.265536
C  -2.689989 -6.619581 -0.547896
C  -0.961556 -7.155349 -2.122701
C  -1.966626 -7.568161 -1.259073
H  2.588369 3.528022 -0.498925
H  0.227489 3.752158 1.485591
H  2.935835 1.258746 0.192737
H  3.949428 1.561454 1.592354
H  2.430049 0.695927 1.787242
H  2.022247 2.504938 3.647957
H  3.427464 3.468722 3.197176
H  1.820926 4.190731 3.177376
H  1.456697 5.829974 1.114359
H  5.550993 5.626146 0.770043
H  4.689695 4.339003 -0.069174
H  5.034762 5.866461 -0.883521
H  4.260515 7.702296 1.618088
H  3.800685 8.049068 -0.034124
H  2.551694 7.868329 1.201474
H  -1.682596 1.203355 -1.453573
H  -1.746401 -1.088829 -2.026602
H  -0.826022 0.034998 2.01568
H  -0.166938 -2.286705 2.490335
H  -0.292922 -4.015531 0.754919
H  -2.995919 -4.535417 -0.141666
H  0.119861 -5.480943 -2.933724
H  -3.482346 -6.930211 0.120265
H  -0.393674 -7.884737 -2.685138
H  -2.188995 -8.620514 -1.144354
elementType: O N C H
totalener: -1210.09255798 hartree
nucrepener: 2394.09711563 hartree
electener: -3604.18967361 hartree
oneelecener: -6399.66429078 hartree
twoeener: 2795.47461716 hartree
cpcmener: -0.03638272 hartree
kineticenergy: 1204.69752943 hartree
xcener: -118.582295288588 hartree
chargesum: -0.0000000
charge: -0.289258 -0.467066 -0.335781 -0.101895 0.146840 -0.005416 -0.111229 -0.293379 -0.268702 -0.268321 0.391544 -0.033740 -0.250609 -0.229020 0.414427 0.039730 -0.222390 -0.255561 -0.228996 0.284893 -0.138965 -0.181731 0.287300 -0.196045 -0.249828 -0.146164 -0.125933 -0.186114 0.102014 0.094917 0.095061 0.100683 0.098760 0.100005 0.097701 0.092512 0.124922 0.096070 0.087851 0.100774 0.094763 0.095023 0.089475 0.145448 0.135709 0.151106 0.163505 0.159604 0.160811 0.148944 0.162807 0.161221 0.161720
qa: -0.2893 -0.4671 -0.3358 -0.1019 0.1468 -0.0054 -0.1112 -0.2934 -0.2687 -0.2683 0.3915 -0.0337 -0.2506 -0.2290 0.4144 0.0397 -0.2224 -0.2556 -0.2290 0.2849 -0.1390 -0.1817 0.2873 -0.1960 -0.2498 -0.1462 -0.1259 -0.1861 0.1020 0.0949 0.0951 0.1007 0.0988 0.1000 0.0977 0.0925 0.1249 0.0961 0.0879 0.1008 0.0948 0.0950 0.0895 0.1454 0.1357 0.1511 0.1635 0.1596 0.1608 0.1489 0.1628 0.1612 0.1617
va: 2.1124 2.0380 2.0670 3.1125 3.6666 3.8028 3.8807 3.8974 3.9054 3.8698 4.1801 3.7002 3.9406 3.9269 3.6997 3.6175 4.0792 4.1036 3.9513 3.7316 3.9114 3.9137 3.6696 3.9138 4.0065 3.8842 3.8797 3.8978 1.0216 1.0375 1.0161 1.0017 1.0011 1.0029 1.0020 1.0025 1.0058 0.9978 1.0076 0.9979 0.9963 0.9951 1.0077 1.0185 1.0181 1.0116 0.9900 0.9947 0.9954 1.0071 0.9891 0.9882 0.9891
dispcorr: -0.025194972 hartree
energy: -1210.117752952470
dipole: 30.95867 -29.03038 1.92829 25.03710 -25.30504 -0.26794 12.34797 -11.31313 1.03483
magnitude: 2.20476 au
magnitude: 5.60405 debye
