program: Orca
programVersion: 5.0.2
elementType: O O O N C C C C C C C C C C C C C C C C C C C C C C C C H H H H H H H H H H H H H H H H H H H H H H H H H
charge: 0
multiplicity: 1
keywords: wb97x-d3
keywords: def2-TZVPP
keywords: def2/J RIJCOSX
keywords: DEFGRID2
keywords: scfconv7
keywords: smallprint printgap noloewdin
keywords: NOSOSCF
formula: C24H25NO3
InChI: InChI=1/C24H25NO3/c1-16(2)13-20-22(24(20,3)4)23(26)28-21(15-25)17-9-8-12-19(14-17)27-18-10-6-5-7-11-18/h5-14,20-22H,1-4H3
53 atoms
O  -1.246385 2.18111 0.126271
O  0.533055 1.261436 -0.863105
O  -1.655485 -3.435499 -1.494189
N  -4.505446 2.263121 -0.353484
C  1.924728 2.47196 1.721305
C  2.285998 3.263654 0.502423
C  0.826263 2.972771 0.792532
C  2.281982 1.00664 1.754373
C  1.977629 3.121573 3.082812
C  2.753104 4.662739 0.564701
C  0.079141 2.053026 -0.073715
C  3.782515 5.188166 -0.107735
C  4.66699 4.431128 -1.050673
C  4.129514 6.63942 0.037484
C  -2.086707 1.307217 -0.616289
C  -2.041583 -0.114714 -0.107883
C  -3.434658 1.857162 -0.461465
C  -1.837753 -1.148764 -1.007618
C  -2.194111 -0.376888 1.248588
C  -1.80297 -2.458275 -0.54872
C  -2.146416 -1.688811 1.692229
C  -1.955969 -2.737179 0.803096
C  -0.962944 -4.582802 -1.181502
C  -1.541272 -5.795317 -1.523083
C  0.298211 -4.530444 -0.601395
C  -0.843221 -6.971612 -1.284437
C  0.979537 -5.713996 -0.359081
C  0.414387 -6.93698 -0.698563
H  2.701887 2.664206 -0.300114
H  0.238371 3.792185 1.190807
H  1.546889 0.436578 2.325948
H  2.363413 0.560397 0.765673
H  3.248528 0.880458 2.245569
H  2.999449 3.114704 3.466957
H  1.631056 4.153858 3.07535
H  1.354888 2.571334 3.790033
H  2.190563 5.32357 1.217796
H  5.716258 4.565991 -0.778106
H  4.470034 3.361583 -1.079304
H  4.563119 4.817036 -2.067978
H  4.095219 7.14711 -0.930077
H  3.452289 7.15943 0.714513
H  5.147901 6.76438 0.414087
H  -1.843798 1.33709 -1.683472
H  -1.707819 -0.942022 -2.063013
H  -2.35304 0.427912 1.955056
H  -2.268858 -1.905146 2.744917
H  -1.935159 -3.755995 1.167481
H  -2.524426 -5.818333 -1.975553
H  0.750001 -3.580056 -0.345901
H  -1.292418 -7.918816 -1.552535
H  1.96264 -5.676614 0.091307
H  0.95244 -7.85615 -0.509458
elementType: O N C H
totalener: -1210.09393872 hartree
nucrepener: 2417.31973841 hartree
electener: -3627.41367713 hartree
oneelecener: -6446.16949868 hartree
twoeener: 2818.75582155 hartree
cpcmener: -0.03645032 hartree
kineticenergy: 1204.69190380 hartree
xcener: -118.581094787326 hartree
chargesum: 0.0000000
charge: -0.283494 -0.471016 -0.339363 -0.102794 0.102528 0.047494 -0.095288 -0.272437 -0.269040 -0.287862 0.395477 -0.046664 -0.254752 -0.218226 0.419136 0.020429 -0.220104 -0.229401 -0.229271 0.254230 -0.146379 -0.162413 0.254573 -0.233604 -0.173568 -0.133938 -0.153952 -0.177055 0.093678 0.095066 0.097342 0.093118 0.099526 0.098594 0.089589 0.098649 0.121337 0.094947 0.091192 0.098942 0.093382 0.088906 0.094478 0.143323 0.139129 0.151296 0.163689 0.160527 0.149478 0.163217 0.161927 0.163128 0.162292
qa: -0.2835 -0.4710 -0.3394 -0.1028 0.1025 0.0475 -0.0953 -0.2724 -0.2690 -0.2879 0.3955 -0.0467 -0.2548 -0.2182 0.4191 0.0204 -0.2201 -0.2294 -0.2293 0.2542 -0.1464 -0.1624 0.2546 -0.2336 -0.1736 -0.1339 -0.1540 -0.1771 0.0937 0.0951 0.0973 0.0931 0.0995 0.0986 0.0896 0.0986 0.1213 0.0949 0.0912 0.0989 0.0934 0.0889 0.0945 0.1433 0.1391 0.1513 0.1637 0.1605 0.1495 0.1632 0.1619 0.1631 0.1623
va: 2.1261 2.0381 2.0575 3.1104 3.7021 3.7750 3.8376 3.9053 3.9086 3.8768 4.1792 3.7563 3.9417 3.9202 3.7066 3.6016 4.0872 4.0690 3.9589 3.7631 3.9170 3.8971 3.6960 4.0012 3.9058 3.8825 3.8896 3.8899 1.0313 1.0349 1.0004 1.0160 1.0008 1.0016 1.0058 1.0016 1.0102 0.9976 1.0092 0.9960 0.9957 1.0088 0.9965 1.0167 1.0177 1.0109 0.9896 0.9943 1.0060 0.9943 0.9880 0.9893 0.9889
dispcorr: -0.024640733 hartree
energy: -1210.118579449477
dipole: 33.11806 -31.02671 2.09135 20.01231 -20.53437 -0.52207 10.96743 -9.81839 1.14904
magnitude: 2.44266 au
magnitude: 6.20875 debye
