program: Gaussian 09
title: 000007745
version: EM64L-G09RevD.01
frameworkgroup: C1[X(C6H14O)]
method: RPBEPBE
basis: SDD
operation: Freq
keyword: #pfreq=noraman
keyword: PBEPBE/SDD
title: #p freq=noraman PBEPBE/SDD
converged: YES YES NO NO
title: Mulliken charges:
elementType: O C C C C C C H H H H H H H H H H H H H H
charge: -0.438003 -0.053750 -0.366027 -0.363672 -0.348325 -0.714099 -0.689075 0.179963 0.186096 0.193757 0.195972 0.193594 0.196294 0.209304 0.204903 0.210122 0.238954 0.210952 0.209521 0.216416 0.327103
chargesum: 0.00000
title: Mulliken charges with hydrogens summed into heavy atoms:
elementType: O C C C C C C
charge: -0.110901 0.126214 0.013826 0.025894 0.057272 -0.060119 -0.052186
polarizability: 7.99450654e+01 1.31290480e+00 6.54676060e+01 -1.13982031e+00 9.37219066e-01 6.21196924e+01
1716.lowfreq: -10.1774 -0.0011 -0.0009 -0.0008 6.5437 16.2434 62.3950 93.3307 111.5759
frequency: 61.3559 93.2968 111.5528 186.6866 221.3393 233.9347 248.3759 301.4363 323.3602 365.7944 439.0385 519.6178 733.6373 819.9859 860.2984 888.6448 900.8131 948.1650 972.1719 1018.8772 1046.5390 1073.2090 1093.5456 1134.7355 1157.2139 1204.0953 1242.8936 1271.2201 1285.9929 1304.6974 1325.8902 1346.8665 1356.4815 1368.8946 1385.9453 1392.3091 1461.7571 1467.5721 1472.9391 1475.2948 1478.0647 1484.1007 1487.6258 2931.6845 2956.0564 2965.7268 2972.1883 2972.6762 2973.2215 3000.9755 3030.2090 3059.1462 3065.8249 3069.5612 3072.5866 3084.0669 3556.7842
redmass: 1.6822 2.5409 2.8936 2.0579 1.3364 1.1174 2.0153 1.2174 3.0423 2.4288 2.0226 3.0573 1.1295 1.8979 1.5046 1.8689 1.3136 1.8033 2.6638 1.6816 2.1373 1.8278 1.4521 2.1280 2.2102 1.6335 1.3700 1.2413 1.1249 1.2046 1.4002 1.3614 1.5157 1.2412 1.2166 1.2139 1.0719 1.0720 1.0599 1.0587 1.0419 1.0571 1.0758 1.0817 1.0607 1.0622 1.0483 1.0440 1.0420 1.0980 1.1024 1.0991 1.0984 1.1007 1.0993 1.0994 1.0660
irintensity: 0.2346 3.4563 0.9481 1.0328 0.0988 0.1770 5.2963 109.5905 12.9239 25.2106 10.7998 5.6736 10.2251 1.8010 2.4920 3.1124 24.8683 2.6273 94.0303 12.3540 2.0892 8.4914 11.5311 0.4055 1.5046 3.1422 1.7712 3.5320 0.3656 4.0498 2.6439 13.6044 3.9312 10.1364 16.7189 10.3404 0.8510 5.6289 2.3911 10.6293 14.8224 9.9594 13.4940 22.5094 15.5739 78.6482 45.5437 66.6431 14.9741 2.1649 40.4307 12.8439 57.0760 96.9334 54.0763 26.2989 5.8321
temp: 298.150 k
press: 1.00000 atm
elementType: 8 6 6 6 6 6 6 1 1 1 1 1 1 1 1 1 1 1 1 1 1
symmnumber: 1
zpe: 498106.9 jmol-1
zpe.correction: 0.189719 hartree
zpe.thermalcorrener: 0.199317 hartree
zpe.thermalcorrenthalpy: 0.200261 hartree
zpe.thermalcorrgfe: 0.155378 hartree
zpe.sumelectzpe: -311.638995 hartree
zpe.sumelectthermal: -311.629397 hartree
zpe.sumelectthermalent: -311.628453 hartree
zpe.sumelectthermalfe: -311.673336 hartree
dipole: -1.8272 0.1230 -1.1255
dipole: 2.1495
quadrupole: -54.0724 -46.4073 -43.2318
quadrupole: 1.6524 -3.4198 1.8401
quadrupole: -6.1685 1.4965 4.6720 1.6524 -3.4198 1.8401
hfenergy: -311.8287139 hartree
pointgroup: C01[X(C6H14O1)]
dipole: -0.7204643 -0.0436009 0.440712 debye
dipolederiv: -0.7781738 -0.1843233 -0.1808612 -0.2173783 -0.6590423 0.0553766 -0.219268 0.0574641 -0.2029928 -0.0229519 -0.0497235 -0.0255 -0.0400764 0.0140236 0.0274414 0.0590253 0.0585865 0.145774 -0.0065261 0.0466742 -0.0143033 0.0073192 0.0522846 -0.0336384 0.0043787 -0.0267461 0.1444395 0.0152386 0.0258491 -0.0189243 0.0104214 0.1018416 -0.0358142 -0.0458895 -0.0295817 0.1480432 0.5909929 0.1107856 0.1253192 0.1417146 0.3715127 0.0353129 0.1115274 0.0238364 0.3036316 -0.0672326 0.0417433 0.0047158 0.0507253 -0.0451307 -0.0099264 0.0014853 0.007948 0.0931923 -0.0631527 0.00701 -0.028113 0.0226641 0.0747407 -0.0096811 -0.002527 -0.017162 0.0807502 0.0387971 0.0129507 0.0110646 -0.0228198 -0.0022674 -0.0798548 -0.0045041 -0.0652991 -0.2061428 0.0375665 0.016813 0.0096563 0.0295245 0.0629279 0.0035546 -0.0170055 -0.0281809 -0.1908837 -0.002521 -0.0854311 0.019841 -0.0790683 -0.1549219 0.0433974 0.0343728 0.0693915 0.0482305 0.0215728 -0.0899524 0.0173681 -0.0781647 -0.1623293 0.0403183 0.0242459 0.065925 0.0512808 0.0259682 0.0087006 -0.0458682 0.0129858 0.0659533 0.0077177 -0.0154686 -0.0281796 -0.2029366 -0.0953497 0.1138039 -0.0402166 0.1430626 -0.1559988 0.0106829 -0.0085569 -0.0208158 0.0534479 0.0265293 -0.0173186 0.0128302 -0.0071423 0.0698834 -0.076389 0.0011041 -0.0258484 -0.1363542 0.0921193 -0.0066348 -0.0449294 0.0147317 0.0499545 -0.0279207 -0.0055575 -0.0922149 -0.1582205 0.0619954 -0.0833091 0.0690558 -0.0415729 -0.1007095 0.0964814 0.0505355 0.117327 0.0058688 -0.1505101 0.0341764 -0.0462061 -0.0148793 0.1139441 -0.0153171 -0.0554093 -0.0059489 0.0809304 0.067895 -0.0076646 0.0126224 -0.0162801 0.0909941 0.0031287 -0.0566115 0.0075521 -0.1839918 0.038203 -0.050896 0.0027064 -0.122553 -0.1321102 0.0675828 0.0155071 0.0775541 0.0626666 -0.0933969 0.1155335 0.0458284 0.1515097 -0.0347152 -0.0672721 0.068674 -0.0724283 0.0612929 0.2629369 0.0412129 0.1139137 0.0552761 0.3791647 -0.035181 0.059942 -0.0731791 0.0019737 unknown
polarizability: 79.9207589|-1.4076359|65.4858288|1.1989102|0.9242551|62.125776 unknown
InChI: InChI=1S/C6H14O/c1-3-4-6(2)5-7/h6-7H,3-5H2,1-2H3
charge 0 multiplicity 1
21 atoms
O  2.647078 1.097224 0.080867
C  0.627954 -0.397903 0.273875
C  -0.845913 -0.570511 -0.187787
C  -1.832047 0.493014 0.352804
C  1.292988 0.808928 -0.427976
C  1.447958 -1.684552 0.027719
C  -3.28225 0.250666 -0.118945
H  0.618274 -0.190021 1.36829
H  -0.880696 -0.576497 -1.298528
H  -1.198167 -1.572032 0.133682
H  -1.511811 1.506193 0.037959
H  -1.796716 0.48576 1.461585
H  0.653973 1.713208 -0.347179
H  1.449403 0.585712 -1.498424
H  1.373971 -1.993164 -1.033286
H  1.076713 -2.520431 0.649239
H  2.515543 -1.520394 0.257976
H  -3.350833 0.285474 -1.222735
H  -3.644607 -0.74273 0.207006
H  -3.973088 1.012541 0.286542
H  2.578773 1.321114 1.043716
