program: Gaussian 09
title: 000067327
version: EM64L-G09RevD.01
frameworkgroup: C1[X(C8H19NO2)]
method: RPBEPBE
basis: SDD
operation: Freq
keyword: #p
keyword: freq=noraman
keyword: PBEPBE/SDD
title: #p freq=noraman PBEPBE/SDD
converged: YES YES NO NO
title: Mulliken charges:
elementType: O O N C C C C C C C C H H H H H H H H H H H H H H H H H H H
charge: -0.303573 -0.448792 -0.112612 -0.382740 -0.323988 -0.328482 -0.249291 -0.671239 -0.671050 -0.243258 -0.318257 0.213593 0.215595 0.204769 0.189021 0.206091 0.190403 0.207091 0.191311 0.209667 0.226663 0.207461 0.208785 0.225480 0.207322 0.186060 0.206548 0.206634 0.200168 0.350618
chargesum: 0.00000
title: Mulliken charges with hydrogens summed into heavy atoms:
elementType: O O N C C C C C C C C
charge: -0.303573 -0.098175 -0.112612 0.046448 0.069802 0.068012 0.149112 -0.027449 -0.029462 0.149350 0.088545
polarizability: 1.24436531e+02 9.20029915e-01 1.02667528e+02 -1.11363623e+00 -8.80648796e-01 8.57435919e+01
1716.lowfreq: -17.7754 -5.4012 -0.0010 -0.0007 -0.0006 8.4467 25.9728 35.8815 55.0261
frequency: 25.0515 35.8178 54.9422 66.3071 86.3044 107.1774 116.9930 153.2705 187.0384 206.5809 243.1161 278.7643 289.3897 329.0802 352.2330 418.2582 445.2327 473.8474 491.2401 538.3735 740.4349 792.0722 796.4107 805.0537 832.0734 871.7127 915.8076 976.0495 990.6190 1016.7889 1058.4596 1063.6786 1069.5121 1075.5398 1084.6811 1087.6425 1098.9862 1125.7509 1161.2579 1192.0920 1206.2462 1208.7003 1232.5656 1276.6481 1286.0298 1290.0755 1317.7966 1329.7089 1356.6545 1362.5040 1370.2175 1385.9015 1387.1542 1389.3510 1400.6807 1458.2160 1462.0388 1462.1774 1463.2315 1470.0636 1475.4173 1481.8794 1486.0312 1488.9025 1491.8767 2852.4391 2861.0828 2910.8878 2931.7061 2940.7671 2965.6299 2982.1941 2984.2128 2995.3912 2997.7536 3022.1904 3033.9031 3055.3798 3074.8829 3076.9659 3080.2083 3090.9201 3091.3611 3533.0274
redmass: 3.8728 3.3892 2.9365 2.7677 2.0046 2.4661 2.6548 2.5431 1.6695 1.3371 1.7637 2.0401 2.1016 2.6645 2.7721 3.0434 2.5974 1.2910 2.1153 2.7138 2.7366 1.1816 1.1295 1.2167 2.0788 2.7619 1.8772 2.4567 2.4837 3.5790 2.4722 1.8362 4.1367 1.9354 2.1344 2.3722 1.9519 1.7173 1.3774 1.2006 2.0436 1.2997 1.6958 1.1139 1.2013 1.2360 1.2359 1.2216 1.3388 1.3399 1.3542 1.2556 1.2405 1.2314 1.4651 1.0822 1.0624 1.0784 1.0572 1.0601 1.0645 1.0589 1.0663 1.0772 1.0762 1.0720 1.0714 1.0700 1.0556 1.0562 1.0727 1.0357 1.0358 1.1030 1.1020 1.0872 1.0874 1.0928 1.0983 1.0981 1.0964 1.1004 1.1003 1.0651
irintensity: 1.8180 1.0224 1.0290 0.5809 0.2311 0.5946 0.8892 12.4823 3.3242 0.5509 0.4689 2.4004 2.3811 0.8848 3.4116 8.5870 2.4465 138.6435 47.7892 3.9039 10.4495 6.2277 3.8840 5.5506 10.4697 17.8855 0.3257 18.0537 6.3922 132.6909 27.2745 32.7799 135.2936 18.9628 2.8013 7.2156 4.0154 5.9027 7.2749 10.8870 32.5651 18.5691 19.8534 0.7174 13.2264 24.6557 9.2275 12.1019 1.7741 1.4851 8.9314 25.3374 27.6301 19.6240 0.8776 13.1794 10.8990 0.5916 5.5656 2.5604 0.1908 10.8191 8.6624 15.9886 7.9734 33.7225 168.3026 71.0175 30.8083 98.2206 27.6631 29.8428 29.4810 76.6198 65.4773 17.9611 16.9853 39.4516 44.8681 74.9797 39.5931 27.9454 55.9176 9.6114
temp: 298.150 k
press: 1.00000 atm
elementType: 8 8 7 6 6 6 6 6 6 6 6 1 1 1 1 1 1 1 1 1 1 1 1 1 1 1 1 1 1 1
symmnumber: 1
zpe: 697869.2 jmol-1
zpe.correction: 0.265804 hartree
zpe.thermalcorrener: 0.280417 hartree
zpe.thermalcorrenthalpy: 0.281361 hartree
zpe.thermalcorrgfe: 0.222366 hartree
zpe.sumelectzpe: -520.452763 hartree
zpe.sumelectthermal: -520.438150 hartree
zpe.sumelectthermalent: -520.437206 hartree
zpe.sumelectthermalfe: -520.496201 hartree
dipole: 2.6057 -1.7510 0.3375
dipole: 3.1575
quadrupole: -80.2318 -67.9677 -70.1217
quadrupole: 9.5948 -4.7926 -1.2332
quadrupole: -7.4581 4.8060 2.6520 9.5948 -4.7926 -1.2332
hfenergy: -520.7185671 hartree
pointgroup: C01 [X(C8H19N1O2)]
dipole: -1.0059286 -0.7169234 -0.1316997 debye
polarizability: 124.49136|-0.3995092|102.661632|-0.6381139|0.5205498|85.6946593 unknown
InChI: InChI=1S/C8H19NO2/c1-3-9(4-2)5-7-11-8-6-10/h10H,3-8H2,1-2H3
charge 0 multiplicity 1
30 atoms
O  1.8337 -0.22823 0.312019
O  4.291974 1.135034 0.408796
N  -1.900943 -0.027894 0.151315
C  -0.523092 0.222379 0.645023
C  -2.824065 1.118494 0.362012
C  -2.451396 -1.324945 0.630694
C  0.510829 -0.397361 -0.305906
C  -2.555483 2.286713 -0.605502
C  -3.529908 -1.906775 -0.303373
C  2.937386 -0.691644 -0.543436
C  4.219379 -0.31355 0.200821
H  -0.358649 -0.180555 1.671738
H  -0.339654 1.309968 0.698082
H  -3.854186 0.755117 0.194255
H  -2.786673 1.485808 1.419269
H  -1.612344 -2.043726 0.689012
H  -2.858816 -1.234689 1.67004
H  0.471173 0.109845 -1.292859
H  0.30439 -1.478531 -0.46333
H  -1.538874 2.701598 -0.478119
H  -2.654357 1.944068 -1.650203
H  -3.275424 3.107978 -0.430209
H  -4.410706 -1.244051 -0.381117
H  -3.118715 -2.044602 -1.318589
H  -3.881473 -2.885086 0.074665
H  2.873395 -1.790257 -0.7054
H  2.892457 -0.176131 -1.527044
H  5.107508 -0.582756 -0.395327
H  4.254712 -0.855412 1.169398
H  3.408455 1.405994 0.772873
