program: Orca
programVersion: 5.0.2
elementType: O O O N C C C C C C C C C C C C C C C C C C C C C C C C H H H H H H H H H H H H H H H H H H H H H H H H H
charge: 0
multiplicity: 1
keywords: wb97x-d3
keywords: def2-TZVPP
keywords: def2/J RIJCOSX
keywords: DEFGRID2
keywords: scfconv7
keywords: smallprint printgap noloewdin
keywords: NOSOSCF
formula: C24H25NO3
InChI: InChI=1/C24H25NO3/c1-16(2)13-20-22(24(20,3)4)23(26)28-21(15-25)17-9-8-12-19(14-17)27-18-10-6-5-7-11-18/h5-14,20-22H,1-4H3
53 atoms
O  -1.096391 1.932608 -0.706589
O  0.655896 0.545012 -0.70868
O  -2.078211 -3.816093 0.140936
N  -4.099373 2.027966 -2.078378
C  1.45248 2.465911 1.67983
C  2.332212 2.719853 0.494723
C  0.836901 2.711778 0.304973
C  1.426403 1.087348 2.291332
C  1.254778 3.570206 2.686883
C  3.063268 4.00117 0.321133
C  0.179873 1.613953 -0.414146
C  4.337361 4.205263 0.665494
C  5.202358 3.157328 1.294656
C  5.000216 5.530061 0.442039
C  -1.892169 0.893093 -1.261568
C  -2.210494 -0.175527 -0.240822
C  -3.120166 1.548964 -1.71195
C  -1.984285 -1.505523 -0.558152
C  -2.705449 0.185711 1.007071
C  -2.243915 -2.483006 0.394212
C  -2.97184 -0.803165 1.940455
C  -2.735232 -2.137359 1.644538
C  -1.035004 -4.258725 -0.634965
C  -1.290733 -5.345063 -1.459336
C  0.236965 -3.703866 -0.562842
C  -0.26061 -5.884408 -2.216187
C  1.254229 -4.247799 -1.334585
C  1.013394 -5.336287 -2.162399
H  2.840154 1.834964 0.121166
H  0.354773 3.676828 0.191604
H  0.436537 0.851357 2.688073
H  1.707139 0.300888 1.59391
H  2.131237 1.046864 3.123809
H  2.075196 3.574405 3.40763
H  1.214683 4.556204 2.225462
H  0.32713 3.422462 3.242555
H  2.507863 4.826462 -0.115074
H  6.0648 2.933715 0.661682
H  5.605338 3.516486 2.244765
H  4.676999 2.223817 1.489174
H  5.871517 5.428075 -0.209915
H  4.324872 6.256582 -0.009259
H  5.36688 5.947503 1.383064
H  -1.414516 0.452805 -2.14262
H  -1.604052 -1.768321 -1.537808
H  -2.88591 1.224673 1.252548
H  -3.359721 -0.535189 2.913885
H  -2.934545 -2.907972 2.377929
H  -2.286405 -5.7677 -1.501957
H  0.442298 -2.859441 0.083134
H  -0.461545 -6.733181 -2.856371
H  2.244838 -3.816031 -1.280092
H  1.812914 -5.754324 -2.759092
elementType: O N C H
totalener: -1210.09225488 hartree
nucrepener: 2471.12944199 hartree
electener: -3681.22169687 hartree
oneelecener: -6553.67933909 hartree
twoeener: 2872.45764222 hartree
cpcmener: -0.03498548 hartree
kineticenergy: 1204.70062109 hartree
xcener: -118.582529507264 hartree
chargesum: -0.0000000
charge: -0.282537 -0.468052 -0.337801 -0.101333 0.140348 -0.010746 -0.105367 -0.291829 -0.273146 -0.262490 0.388809 -0.037725 -0.249005 -0.229944 0.417986 0.026283 -0.219409 -0.206738 -0.246229 0.293388 -0.123060 -0.227142 0.300171 -0.258927 -0.200797 -0.121354 -0.147621 -0.191581 0.103355 0.097412 0.099557 0.094092 0.101125 0.098348 0.093814 0.100514 0.124038 0.101501 0.096249 0.087544 0.095685 0.089968 0.094569 0.141380 0.149329 0.149147 0.162203 0.151148 0.148478 0.160520 0.161598 0.162473 0.161803
qa: -0.2825 -0.4681 -0.3378 -0.1013 0.1403 -0.0107 -0.1054 -0.2918 -0.2731 -0.2625 0.3888 -0.0377 -0.2490 -0.2299 0.4180 0.0263 -0.2194 -0.2067 -0.2462 0.2934 -0.1231 -0.2271 0.3002 -0.2589 -0.2008 -0.1214 -0.1476 -0.1916 0.1034 0.0974 0.0996 0.0941 0.1011 0.0983 0.0938 0.1005 0.1240 0.1015 0.0962 0.0875 0.0957 0.0900 0.0946 0.1414 0.1493 0.1491 0.1622 0.1511 0.1485 0.1605 0.1616 0.1625 0.1618
va: 2.1238 2.0369 2.0724 3.1102 3.6725 3.8076 3.8627 3.8998 3.9036 3.8627 4.1987 3.7041 3.9383 3.9269 3.7160 3.5718 4.0831 3.9511 3.9602 3.7072 3.8972 4.0083 3.6700 4.0093 3.9049 3.8752 3.8902 3.9023 1.0211 1.0351 1.0004 1.0136 1.0023 1.0013 1.0017 1.0030 1.0057 0.9982 0.9979 1.0080 0.9950 1.0074 0.9963 1.0183 1.0048 1.0117 0.9881 1.0040 1.0077 0.9962 0.9878 0.9895 0.9892
dispcorr: -0.026338977 hartree
energy: -1210.118593861819
dipole: 32.87094 -30.91180 1.95914 20.39251 -20.23189 0.16062 15.62161 -14.36874 1.25288
magnitude: 2.33103 au
magnitude: 5.92502 debye
