program: Orca
programVersion: 5.0.2
elementType: O O O N C C C C C C C C C C C C C C C C C C C C C C C C H H H H H H H H H H H H H H H H H H H H H H H H H
charge: 0
multiplicity: 1
keywords: wb97x-d3
keywords: def2-TZVPP
keywords: def2/J RIJCOSX
keywords: DEFGRID2
keywords: scfconv7
keywords: smallprint printgap noloewdin
keywords: NOSOSCF
formula: C24H25NO3
InChI: InChI=1/C24H25NO3/c1-16(2)13-20-22(24(20,3)4)23(26)28-21(15-25)17-9-8-12-19(14-17)27-18-10-6-5-7-11-18/h5-14,20-22H,1-4H3
53 atoms
O  -1.113533 1.939202 -0.699017
O  0.634695 0.546506 -0.734142
O  -2.056122 -3.805575 0.141136
N  -4.126405 2.067582 -2.041218
C  1.449849 2.44232 1.672594
C  2.327984 2.697498 0.486566
C  0.832364 2.701647 0.301055
C  1.418783 1.059906 2.275128
C  1.262102 3.541243 2.687521
C  3.07113 3.972548 0.318097
C  0.164743 1.613452 -0.423364
C  4.34665 4.161635 0.666094
C  5.196927 3.102469 1.296839
C  5.027473 5.477506 0.444306
C  -1.920114 0.908352 -1.256065
C  -2.232693 -0.166322 -0.240142
C  -3.148117 1.575985 -1.689143
C  -1.991022 -1.493446 -0.558639
C  -2.732623 0.187865 1.007828
C  -2.238364 -2.474573 0.393329
C  -2.988153 -0.804629 1.940142
C  -2.734701 -2.135503 1.643474
C  -1.009997 -4.239677 -0.635381
C  -1.253041 -5.342597 -1.441761
C  0.253261 -3.662946 -0.58086
C  -0.21958 -5.876157 -2.198079
C  1.27386 -4.201571 -1.352142
C  1.045608 -5.306348 -2.161804
H  2.827462 1.810453 0.106721
H  0.356776 3.670954 0.196161
H  0.431936 0.828876 2.681281
H  1.685981 0.276151 1.570094
H  2.132043 1.008668 3.099491
H  2.08675 3.538973 3.40317
H  1.221424 4.529971 2.232393
H  0.337676 3.392527 3.247979
H  2.525797 4.804067 -0.119045
H  5.609144 3.45917 2.243948
H  4.657205 2.178346 1.497425
H  6.053467 2.861908 0.661795
H  4.363471 6.212941 -0.009425
H  5.39748 5.890308 1.386056
H  5.899123 5.36312 -0.205224
H  -1.453401 0.473452 -2.145589
H  -1.607762 -1.750856 -1.538504
H  -2.925037 1.224563 1.253945
H  -3.380439 -0.542074 2.913237
H  -2.924935 -2.90891 2.376354
H  -2.24177 -5.782633 -1.470407
H  0.450027 -2.805655 0.050742
H  -0.410837 -6.737896 -2.823874
H  2.257424 -3.752447 -1.311549
H  1.84778 -5.720177 -2.757931
elementType: O N C H
totalener: -1210.09223380 hartree
nucrepener: 2472.95694238 hartree
electener: -3683.04917619 hartree
oneelecener: -6557.32854791 hartree
twoeener: 2874.27937172 hartree
cpcmener: -0.03488134 hartree
kineticenergy: 1204.69775274 hartree
xcener: -118.582017946869 hartree
chargesum: -0.0000000
charge: -0.282082 -0.467748 -0.337234 -0.101554 0.139755 -0.010908 -0.105948 -0.291548 -0.273171 -0.262837 0.389008 -0.037437 -0.248975 -0.229885 0.419166 0.027317 -0.219588 -0.211731 -0.246448 0.297998 -0.122861 -0.228429 0.303720 -0.260314 -0.203563 -0.120539 -0.147707 -0.192195 0.103233 0.097653 0.099774 0.093567 0.101385 0.098452 0.093879 0.100447 0.123967 0.096194 0.087405 0.101752 0.090063 0.094604 0.095545 0.140906 0.149918 0.148952 0.162264 0.151025 0.148060 0.161050 0.161593 0.162320 0.161730
qa: -0.2821 -0.4677 -0.3372 -0.1016 0.1398 -0.0109 -0.1059 -0.2915 -0.2732 -0.2628 0.3890 -0.0374 -0.2490 -0.2299 0.4192 0.0273 -0.2196 -0.2117 -0.2464 0.2980 -0.1229 -0.2284 0.3037 -0.2603 -0.2036 -0.1205 -0.1477 -0.1922 0.1032 0.0977 0.0998 0.0936 0.1014 0.0985 0.0939 0.1004 0.1240 0.0962 0.0874 0.1018 0.0901 0.0946 0.0955 0.1409 0.1499 0.1490 0.1623 0.1510 0.1481 0.1611 0.1616 0.1623 0.1617
va: 2.1245 2.0373 2.0739 3.1100 3.6737 3.8074 3.8614 3.9000 3.9033 3.8621 4.2003 3.7046 3.9382 3.9270 3.7166 3.5687 4.0827 3.9516 3.9616 3.7040 3.8970 4.0097 3.6683 4.0090 3.9055 3.8743 3.8906 3.9028 1.0211 1.0350 1.0005 1.0135 1.0023 1.0013 1.0018 1.0031 1.0058 0.9980 1.0080 0.9982 1.0074 0.9964 0.9950 1.0182 1.0047 1.0116 0.9881 1.0041 1.0079 0.9957 0.9878 0.9896 0.9892
dispcorr: -0.026396267 hartree
energy: -1210.118630069520
dipole: 32.98511 -31.02652 1.95859 20.03606 -19.90118 0.13488 15.57497 -14.33036 1.24461
magnitude: 2.32451 au
magnitude: 5.90842 debye
