program: Orca
programVersion: 5.0.2
elementType: O O O N C C C C C C C C C C C C C C C C C C C C C C C C H H H H H H H H H H H H H H H H H H H H H H H H H
charge: 0
multiplicity: 1
keywords: wb97x-d3
keywords: def2-TZVPP
keywords: def2/J RIJCOSX
keywords: DEFGRID2
keywords: scfconv7
keywords: smallprint printgap noloewdin
keywords: NOSOSCF
formula: C24H25NO3
InChI: InChI=1/C24H25NO3/c1-16(2)13-20-22(24(20,3)4)23(26)28-21(15-25)17-9-8-12-19(14-17)27-18-10-6-5-7-11-18/h5-14,20-22H,1-4H3
53 atoms
O  -1.212246 1.912299 0.057296
O  -1.16377 1.387127 -2.111251
O  -0.971782 -3.078753 0.484306
N  -3.413222 2.382577 2.454309
C  1.535291 3.190559 -0.447664
C  1.644525 1.887376 0.275563
C  0.871668 1.956323 -1.039416
C  0.714617 4.298569 0.167102
C  2.711219 3.718419 -1.235465
C  2.894878 1.108064 0.357522
C  -0.577648 1.732814 -1.112752
C  3.192419 0.189977 1.284404
C  2.27036 -0.260369 2.376154
C  4.531434 -0.483988 1.290841
C  -2.577737 1.54847 0.12271
C  -2.78961 0.052814 0.014071
C  -3.031683 2.02429 1.430257
C  -1.777878 -0.822009 0.37849
C  -4.002193 -0.427307 -0.462463
C  -1.965159 -2.18311 0.186325
C  -4.194998 -1.794514 -0.585196
C  -3.171055 -2.680229 -0.281475
C  0.283286 -2.904424 -0.04355
C  1.311577 -3.588242 0.593426
C  0.541494 -2.134983 -1.17282
C  2.603226 -3.499212 0.097903
C  1.843782 -2.045851 -1.647404
C  2.879231 -2.723166 -1.020599
H  1.008317 1.820657 1.150329
H  1.376307 1.555739 -1.911471
H  1.375566 4.970376 0.717723
H  0.216908 4.890946 -0.602811
H  -0.039563 3.947438 0.867483
H  3.243525 2.942538 -1.783484
H  2.372697 4.457049 -1.96402
H  3.424754 4.210986 -0.572174
H  3.643753 1.313189 -0.401277
H  2.7558 -0.179855 3.351831
H  1.334055 0.291945 2.423656
H  2.023152 -1.316787 2.242128
H  5.087761 -0.226495 2.196422
H  4.426974 -1.571482 1.294878
H  5.140466 -0.204691 0.431249
H  -3.169235 2.064159 -0.641307
H  -0.836947 -0.461546 0.777833
H  -4.786938 0.262759 -0.745348
H  -5.138623 -2.174904 -0.951924
H  -3.303939 -3.74608 -0.414502
H  1.098777 -4.186912 1.470086
H  -0.247393 -1.605147 -1.689929
H  3.399685 -4.033982 0.598635
H  2.041388 -1.439801 -2.521929
H  3.890569 -2.645177 -1.396116
elementType: O N C H
totalener: -1210.09020674 hartree
nucrepener: 2653.13850226 hartree
electener: -3863.22870899 hartree
oneelecener: -6917.42656844 hartree
twoeener: 3054.19785944 hartree
cpcmener: -0.03747296 hartree
kineticenergy: 1204.70168607 hartree
xcener: -118.590328748388 hartree
chargesum: -0.0000000
charge: -0.279237 -0.465712 -0.336453 -0.099301 0.108616 0.068909 -0.084616 -0.266256 -0.295476 -0.324880 0.389891 -0.041003 -0.272026 -0.235559 0.374127 0.035687 -0.223440 -0.185861 -0.216925 0.243941 -0.111843 -0.225500 0.331600 -0.269147 -0.191697 -0.131623 -0.177912 -0.182231 0.110811 0.099286 0.096914 0.101185 0.090433 0.092873 0.098969 0.102809 0.121437 0.111343 0.091631 0.099742 0.110026 0.090225 0.094924 0.151394 0.154963 0.148361 0.162573 0.150490 0.145373 0.153687 0.161383 0.161844 0.161250
qa: -0.2792 -0.4657 -0.3365 -0.0993 0.1086 0.0689 -0.0846 -0.2663 -0.2955 -0.3249 0.3899 -0.0410 -0.2720 -0.2356 0.3741 0.0357 -0.2234 -0.1859 -0.2169 0.2439 -0.1118 -0.2255 0.3316 -0.2691 -0.1917 -0.1316 -0.1779 -0.1822 0.1108 0.0993 0.0969 0.1012 0.0904 0.0929 0.0990 0.1028 0.1214 0.1113 0.0916 0.0997 0.1100 0.0902 0.0949 0.1514 0.1550 0.1484 0.1626 0.1505 0.1454 0.1537 0.1614 0.1618 0.1612
va: 2.1066 2.0283 2.0784 3.1079 3.7807 3.6883 3.8117 3.9050 3.9196 3.8322 4.1310 3.7356 3.9267 3.9097 3.7358 3.5804 4.0748 3.9576 3.9850 3.7447 3.8707 4.0117 3.6376 3.9379 3.8216 3.8261 3.8543 3.8227 1.0136 1.0241 0.9996 1.0002 1.0112 1.0058 1.0006 0.9995 1.0127 1.0005 1.0106 0.9967 0.9969 0.9982 1.0068 1.0126 0.9957 1.0010 0.9874 1.0029 1.0101 1.0069 0.9877 0.9919 0.9880
dispcorr: -0.032751601 hartree
energy: -1210.122958338235
dipole: 28.50873 -27.19624 1.31249 8.41202 -8.45910 -0.04708 1.45212 -2.22781 -0.77569
magnitude: 1.52530 au
magnitude: 3.87701 debye
