program: Orca
programVersion: 5.0.2
elementType: O O O N C C C C C C C C C C C C C C C C C C C C C C C C H H H H H H H H H H H H H H H H H H H H H H H H H
charge: 0
multiplicity: 1
keywords: wb97x-d3
keywords: def2-TZVPP
keywords: def2/J RIJCOSX
keywords: DEFGRID2
keywords: scfconv7
keywords: smallprint printgap noloewdin
keywords: NOSOSCF
formula: C24H25NO3
InChI: InChI=1/C24H25NO3/c1-16(2)13-20-22(24(20,3)4)23(26)28-21(15-25)17-9-8-12-19(14-17)27-18-10-6-5-7-11-18/h5-14,20-22H,1-4H3
53 atoms
O  -0.766932 2.093662 0.16309
O  0.022129 1.449778 -1.820288
O  -2.022701 -3.499934 -1.169878
N  -3.630072 1.961312 1.770051
C  1.099948 4.530377 -0.247603
C  1.61425 3.582052 0.792338
C  1.250649 3.055061 -0.587483
C  -0.262471 5.149475 -0.045901
C  2.053541 5.45562 -0.965858
C  3.022604 3.545962 1.228132
C  0.131765 2.132299 -0.832534
C  3.469335 3.278286 2.460465
C  2.606471 2.956009 3.6426
C  4.94017 3.273956 2.753496
C  -1.851125 1.190322 0.018182
C  -1.448984 -0.241242 0.289914
C  -2.841209 1.634432 1.002486
C  -1.870163 -1.238641 -0.575222
C  -0.668648 -0.549398 1.398352
C  -1.525889 -2.55936 -0.318032
C  -0.321548 -1.87012 1.633513
C  -0.748726 -2.882682 0.786727
C  -1.281421 -4.615993 -1.461664
C  -1.918019 -5.845979 -1.398143
C  0.044103 -4.51946 -1.866801
C  -1.219366 -6.992776 -1.750941
C  0.732824 -5.674543 -2.206034
C  0.10692 -6.913315 -2.15101
H  0.887222 3.347834 1.560932
H  2.083574 2.838908 -1.247598
H  -0.771052 5.305705 -0.999609
H  -0.917397 4.563321 0.595219
H  -0.147528 6.128232 0.424521
H  3.006743 4.986483 -1.206197
H  1.613445 5.795755 -1.905407
H  2.260528 6.339918 -0.359454
H  3.764561 3.750487 0.461792
H  1.538003 2.998252 3.440102
H  2.831667 1.954245 4.018406
H  2.812729 3.644722 4.465943
H  5.188386 4.004994 3.527827
H  5.262061 2.301134 3.13514
H  5.538728 3.503518 1.871827
H  -2.311335 1.274761 -0.971791
H  -2.467074 -0.997419 -1.446814
H  -0.333319 0.225429 2.07626
H  0.282096 -2.121598 2.495573
H  -0.480156 -3.910213 0.996663
H  -2.951625 -5.904165 -1.080619
H  0.535218 -3.555808 -1.924941
H  -1.716743 -7.952944 -1.703319
H  1.764808 -5.601365 -2.52413
H  0.649363 -7.809732 -2.421385
elementType: O N C H
totalener: -1210.10528078 hartree
nucrepener: 2429.08899744 hartree
electener: -3639.19427822 hartree
oneelecener: -6469.39754578 hartree
twoeener: 2830.20326755 hartree
cpcmener: -0.03183081 hartree
kineticenergy: 1204.70456502 hartree
xcener: -118.582667117303 hartree
chargesum: -0.0000000
charge: -0.275901 -0.441714 -0.327544 -0.086664 0.095722 0.058296 -0.095117 -0.266793 -0.281281 -0.286118 0.397494 -0.044978 -0.255180 -0.218536 0.367288 0.028214 -0.227734 -0.225209 -0.204270 0.243357 -0.154403 -0.156171 0.247423 -0.228868 -0.167511 -0.130398 -0.151739 -0.173297 0.101459 0.090544 0.100143 0.089725 0.095693 0.090101 0.098175 0.098558 0.115694 0.088067 0.096909 0.096657 0.093245 0.092519 0.087290 0.141595 0.134690 0.152051 0.159919 0.157324 0.146703 0.159126 0.157361 0.159462 0.158621
qa: -0.2759 -0.4417 -0.3275 -0.0867 0.0957 0.0583 -0.0951 -0.2668 -0.2813 -0.2861 0.3975 -0.0450 -0.2552 -0.2185 0.3673 0.0282 -0.2277 -0.2252 -0.2043 0.2434 -0.1544 -0.1562 0.2474 -0.2289 -0.1675 -0.1304 -0.1517 -0.1733 0.1015 0.0905 0.1001 0.0897 0.0957 0.0901 0.0982 0.0986 0.1157 0.0881 0.0969 0.0967 0.0932 0.0925 0.0873 0.1416 0.1347 0.1521 0.1599 0.1573 0.1467 0.1591 0.1574 0.1595 0.1586
va: 2.1158 2.0722 2.0713 3.1079 3.7072 3.7369 3.8381 3.9126 3.9191 3.8761 4.1756 3.7720 3.9406 3.9222 3.7636 3.6209 4.0706 4.0765 3.9556 3.7824 3.9356 3.8947 3.7174 4.0004 3.9081 3.8895 3.8947 3.8950 1.0179 1.0309 1.0002 1.0101 1.0001 1.0074 1.0008 1.0010 1.0129 1.0118 0.9964 0.9977 0.9962 0.9963 1.0091 1.0181 1.0181 1.0056 0.9911 0.9954 1.0068 0.9957 0.9895 0.9904 0.9900
dispcorr: -0.025074207 hartree
energy: -1210.130354991743
dipole: 26.48256 -24.53974 1.94282 23.31919 -23.53908 -0.21990 9.91498 -9.74290 0.17208
magnitude: 1.96279 au
magnitude: 4.98900 debye
