program: Orca
programVersion: 5.0.2
elementType: O O O N C C C C C C C C C C C C C C C C C C C C C C C C H H H H H H H H H H H H H H H H H H H H H H H H H
charge: 0
multiplicity: 1
keywords: wb97x-d3
keywords: def2-TZVPP
keywords: def2/J RIJCOSX
keywords: DEFGRID2
keywords: scfconv7
keywords: smallprint printgap noloewdin
keywords: NOSOSCF
formula: C24H25NO3
InChI: InChI=1/C24H25NO3/c1-16(2)13-20-22(24(20,3)4)23(26)28-21(15-25)17-9-8-12-19(14-17)27-18-10-6-5-7-11-18/h5-14,20-22H,1-4H3
53 atoms
O  -0.276307 1.1913 0.541122
O  -0.361279 3.114826 -0.587022
O  -1.892286 -3.702352 -1.980548
N  -3.561643 2.003353 0.680834
C  2.723953 2.983022 0.284128
C  1.987465 4.125318 0.919488
C  1.401663 2.7324 0.994028
C  2.794828 2.926132 -1.22181
C  3.949633 2.412814 0.955012
C  2.448593 4.78679 2.15583
C  0.184516 2.417815 0.230254
C  2.509097 6.104394 2.377513
C  2.11998 7.161701 1.389817
C  3.00318 6.637009 3.689317
C  -1.426759 0.7427 -0.159096
C  -1.578091 -0.738934 0.068549
C  -2.613433 1.464286 0.31978
C  -1.633405 -1.57666 -1.034638
C  -1.654696 -1.26161 1.354927
C  -1.78093 -2.945116 -0.852855
C  -1.794198 -2.630213 1.520693
C  -1.862699 -3.480506 0.425512
C  -1.321214 -4.945981 -2.037019
C  -0.036781 -5.186581 -1.564702
C  -2.052476 -5.952876 -2.649995
C  0.507699 -6.454879 -1.704017
C  -1.490063 -7.213615 -2.792485
C  -0.212318 -7.472229 -2.316432
H  1.487356 4.769354 0.204385
H  1.48622 2.206975 1.939397
H  2.830021 1.892785 -1.573658
H  1.957575 3.420839 -1.711132
H  3.706246 3.419607 -1.565149
H  4.135157 1.394623 0.607574
H  4.830896 3.010055 0.711581
H  3.864348 2.376348 2.040323
H  2.766504 4.12907 2.959663
H  1.381016 7.840473 1.824189
H  2.985624 7.77752 1.12916
H  1.704993 6.771762 0.462135
H  3.301561 5.842693 4.373777
H  3.862407 7.298107 3.546692
H  2.233887 7.236205 4.18422
H  -1.337758 0.942273 -1.23075
H  -1.566863 -1.17259 -2.037691
H  -1.614039 -0.613447 2.221448
H  -1.861026 -3.046729 2.517058
H  -1.987296 -4.545512 0.575666
H  0.540529 -4.397417 -1.099073
H  -3.050777 -5.748464 -3.016617
H  1.508154 -6.643321 -1.336262
H  -2.061055 -7.997894 -3.272455
H  0.220859 -8.457804 -2.424465
elementType: O N C H
totalener: -1210.10815355 hartree
nucrepener: 2356.56507458 hartree
electener: -3566.67322814 hartree
oneelecener: -6324.31822092 hartree
twoeener: 2757.64499278 hartree
cpcmener: -0.03261450 hartree
kineticenergy: 1204.70222694 hartree
xcener: -118.580944345584 hartree
chargesum: 0.0000000
charge: -0.281164 -0.445260 -0.327050 -0.088508 0.093728 0.032519 -0.082944 -0.267391 -0.268937 -0.273228 0.387370 -0.051342 -0.249766 -0.216976 0.421293 0.002723 -0.236137 -0.194825 -0.215752 0.228192 -0.148412 -0.156831 0.266654 -0.179710 -0.240079 -0.148758 -0.125605 -0.178996 0.093805 0.094012 0.099284 0.091792 0.098090 0.098113 0.098680 0.088756 0.117444 0.094549 0.096693 0.089729 0.087292 0.092035 0.094025 0.123451 0.137499 0.151313 0.160610 0.158672 0.157681 0.146345 0.159288 0.157860 0.158173
qa: -0.2812 -0.4453 -0.3271 -0.0885 0.0937 0.0325 -0.0829 -0.2674 -0.2689 -0.2732 0.3874 -0.0513 -0.2498 -0.2170 0.4213 0.0027 -0.2361 -0.1948 -0.2158 0.2282 -0.1484 -0.1568 0.2667 -0.1797 -0.2401 -0.1488 -0.1256 -0.1790 0.0938 0.0940 0.0993 0.0918 0.0981 0.0981 0.0987 0.0888 0.1174 0.0945 0.0967 0.0897 0.0873 0.0920 0.0940 0.1235 0.1375 0.1513 0.1606 0.1587 0.1577 0.1463 0.1593 0.1579 0.1582
va: 2.1584 2.0638 2.0730 3.1119 3.7210 3.7802 3.8351 3.9050 3.9080 3.8719 4.1949 3.7707 3.9405 3.9213 3.7111 3.7402 4.0234 4.0345 3.9876 3.8089 3.9257 3.9104 3.7010 3.9038 4.0045 3.8949 3.8895 3.9004 1.0325 1.0305 0.9999 1.0157 1.0005 1.0021 1.0017 1.0062 1.0109 0.9970 0.9970 1.0107 1.0091 0.9963 0.9964 1.0271 1.0165 1.0091 0.9912 0.9946 0.9964 1.0076 0.9904 0.9893 0.9904
dispcorr: -0.023355506 hartree
energy: -1210.131509060705
dipole: 29.87302 -27.39325 2.47976 25.93681 -27.64421 -1.70740 9.91887 -9.57393 0.34494
magnitude: 3.03042 au
magnitude: 7.70271 debye
