program: Orca
programVersion: 5.0.2
elementType: O O O N C C C C C C C C C C C C C C C C C C C C C C C C H H H H H H H H H H H H H H H H H H H H H H H H H
charge: 0
multiplicity: 1
keywords: wb97x-d3
keywords: def2-TZVPP
keywords: def2/J RIJCOSX
keywords: DEFGRID2
keywords: scfconv7
keywords: smallprint printgap noloewdin
keywords: NOSOSCF
formula: C24H25NO3
InChI: InChI=1/C24H25NO3/c1-16(2)13-20-22(24(20,3)4)23(26)28-21(15-25)17-9-8-12-19(14-17)27-18-10-6-5-7-11-18/h5-14,20-22H,1-4H3
53 atoms
O  -0.427162 1.459623 -0.021171
O  -1.045318 3.504114 0.624545
O  -0.065433 -3.470634 -0.604035
N  -2.328861 0.880755 2.711234
C  1.664296 4.157999 -0.960036
C  1.774357 4.410692 0.503815
C  1.237031 3.077054 0.027075
C  0.625208 4.908223 -1.755339
C  2.90918 3.841716 -1.751368
C  3.075753 4.483674 1.216646
C  -0.17849 2.755507 0.248423
C  3.254407 4.164781 2.501431
C  2.158287 3.651099 3.383473
C  4.589741 4.308917 3.164542
C  -1.758455 1.007563 0.158855
C  -1.894582 -0.360305 -0.462841
C  -2.071683 0.952866 1.59403
C  -0.931124 -1.334694 -0.237587
C  -3.007118 -0.636392 -1.245563
C  -1.075925 -2.585411 -0.822157
C  -3.142266 -1.89364 -1.81524
C  -2.181158 -2.871806 -1.617373
C  -0.295004 -4.81692 -0.743288
C  0.488451 -5.522278 -1.642609
C  -1.246026 -5.462686 0.036178
C  0.319218 -6.895613 -1.759571
C  -1.412329 -6.832756 -0.098241
C  -0.632712 -7.553673 -0.994183
H  1.000998 5.064607 0.899806
H  1.905266 2.225114 0.086478
H  0.270955 4.312851 -2.599432
H  -0.240001 5.201495 -1.163064
H  1.062456 5.822735 -2.161104
H  2.659155 3.266587 -2.644974
H  3.400306 4.760527 -2.078867
H  3.634318 3.262159 -1.179931
H  3.925826 4.857323 0.652575
H  2.006455 4.318238 4.236294
H  1.202532 3.544814 2.87282
H  2.423534 2.676408 3.801654
H  5.354963 4.671023 2.477813
H  4.535994 5.005256 4.005793
H  4.928746 3.354767 3.576513
H  -2.474998 1.691646 -0.305718
H  -0.065186 -1.136869 0.383074
H  -3.759259 0.123436 -1.415737
H  -4.00188 -2.114439 -2.434079
H  -2.296634 -3.839582 -2.087681
H  1.226455 -5.002952 -2.241153
H  -1.847813 -4.905177 0.743674
H  0.931746 -7.449257 -2.459431
H  -2.153122 -7.339255 0.506911
H  -0.76641 -8.622938 -1.092867
elementType: O N C H
totalener: -1210.10679317 hartree
nucrepener: 2394.48533772 hartree
electener: -3604.59213088 hartree
oneelecener: -6400.53586337 hartree
twoeener: 2795.94373248 hartree
cpcmener: -0.03077764 hartree
kineticenergy: 1204.70827124 hartree
xcener: -118.581698602002 hartree
chargesum: -0.0000000
charge: -0.283261 -0.449485 -0.323996 -0.092241 0.147399 -0.030915 -0.090087 -0.268854 -0.289306 -0.287951 0.383498 -0.014668 -0.238286 -0.227673 0.416455 0.004575 -0.234581 -0.224083 -0.183480 0.240192 -0.150648 -0.172230 0.238100 -0.213326 -0.173493 -0.137033 -0.149583 -0.164889 0.105042 0.097594 0.100526 0.092539 0.096649 0.098450 0.100460 0.093055 0.123312 0.100481 0.077951 0.096770 0.088666 0.095697 0.094283 0.129091 0.135623 0.145670 0.159712 0.154776 0.147704 0.159301 0.158047 0.159737 0.158711
qa: -0.2833 -0.4495 -0.3240 -0.0922 0.1474 -0.0309 -0.0901 -0.2689 -0.2893 -0.2880 0.3835 -0.0147 -0.2383 -0.2277 0.4165 0.0046 -0.2346 -0.2241 -0.1835 0.2402 -0.1506 -0.1722 0.2381 -0.2133 -0.1735 -0.1370 -0.1496 -0.1649 0.1050 0.0976 0.1005 0.0925 0.0966 0.0985 0.1005 0.0931 0.1233 0.1005 0.0780 0.0968 0.0887 0.0957 0.0943 0.1291 0.1356 0.1457 0.1597 0.1548 0.1477 0.1593 0.1580 0.1597 0.1587
va: 2.1542 2.0527 2.0783 3.1107 3.7230 3.8258 3.8129 3.8901 3.9096 3.8857 4.1578 3.7136 3.9381 3.9299 3.7254 3.7600 4.0155 4.0721 3.9542 3.8076 3.9327 3.8903 3.7198 3.9987 3.9298 3.8891 3.8901 3.8905 1.0267 1.0262 0.9997 1.0146 1.0012 1.0031 0.9992 1.0015 1.0033 0.9994 1.0183 0.9992 1.0066 0.9959 0.9968 1.0247 1.0297 1.0026 0.9919 0.9980 1.0055 0.9951 0.9896 0.9900 0.9901
dispcorr: -0.024332357 hartree
energy: -1210.131125523219
dipole: 21.84874 -21.08490 0.76384 22.33509 -23.32205 -0.98696 0.27924 -2.49823 -2.21899
magnitude: 2.54588 au
magnitude: 6.47110 debye
