program: Gaussian 09
title: 000067308
version: EM64L-G09RevD.01
frameworkgroup: C1[X(C3H7N3O3)]
method: RPBEPBE
basis: SDD
operation: Freq
keyword: #pfreq=noraman
keyword: PBEPBE/SDD
title: #p freq=noraman PBEPBE/SDD
converged: NO YES NO NO
title: Mulliken charges:
elementType: O O O N N N C C C H H H H H H H
charge: -0.403151 -0.321614 -0.254975 -0.150860 -0.583504 -0.625167 -0.450419 0.305455 0.218128 0.257752 0.310856 0.295822 0.331374 0.352944 0.333433 0.383927
chargesum: 0.00000
title: Mulliken charges with hydrogens summed into heavy atoms:
elementType: O O O N N N C C C
charge: -0.019224 -0.321614 -0.254975 -0.150860 0.043691 0.061210 0.118189 0.305455 0.218128
polarizability: 7.91955632e+01 2.59011928e+00 6.62622003e+01 -4.54290925e+00 -2.21144105e+00 4.66921993e+01
1716.lowfreq: -10.2337 -5.9312 -0.0010 -0.0010 -0.0009 7.6158 54.7843 60.2164 108.7890
frequency: 54.7393 60.2026 108.7872 178.7633 268.4798 287.7190 354.5502 375.3107 436.1162 486.6939 505.9400 519.8997 571.7911 606.0984 634.7621 673.2396 721.8478 770.1477 800.2919 851.2493 956.0467 1044.6903 1054.7003 1131.1972 1231.7447 1249.0461 1267.6656 1280.5305 1357.1060 1411.4627 1426.7425 1535.3783 1639.4854 1645.8066 1670.5022 2976.4218 3040.5124 3383.4294 3512.2592 3514.0600 3515.1775 3704.5722
redmass: 4.8715 10.9155 5.7942 4.3775 3.0227 6.2005 4.7726 2.9820 1.1339 1.9204 1.1165 3.4146 5.5468 3.6610 1.5066 1.1737 5.3273 1.5643 3.7232 4.3943 2.2529 2.1026 2.2839 1.8635 2.4137 1.6476 1.3214 2.1679 1.8884 3.0115 1.1146 1.3128 1.8866 6.5150 2.0638 1.0621 1.0962 1.0416 1.0964 1.0692 1.0466 1.1021
irintensity: 0.4898 1.0843 9.9139 8.7711 21.3897 7.5936 16.4917 6.3034 28.3270 20.9523 188.4231 50.3932 5.2443 38.0554 115.3850 65.5496 101.4660 302.4723 1.1802 4.3227 18.4974 44.4898 228.7269 6.6735 3.2980 32.3612 27.5319 45.2468 53.8311 174.7912 64.5936 223.1590 164.9041 279.5005 116.7397 48.9328 18.4074 7.6821 20.1863 16.6302 44.1080 77.7910
temp: 298.150 k
press: 1.00000 atm
elementType: 8 8 8 7 7 7 6 6 6 1 1 1 1 1 1 1
symmnumber: 1
zpe: 315904.9 jmol-1
zpe.correction: 0.120322 hartree
zpe.thermalcorrener: 0.129780 hartree
zpe.thermalcorrenthalpy: 0.130724 hartree
zpe.thermalcorrgfe: 0.085257 hartree
zpe.sumelectzpe: -507.734197 hartree
zpe.sumelectthermal: -507.724738 hartree
zpe.sumelectthermalent: -507.723794 hartree
zpe.sumelectthermalfe: -507.769262 hartree
dipole: -1.3943 3.3991 1.6070
dipole: 4.0101
quadrupole: -40.8298 -57.1174 -52.2687
quadrupole: 6.4352 -1.1454 3.1575
quadrupole: 9.2422 -7.0454 -2.1967 6.4352 -1.1454 3.1575
hfenergy: -507.8545185 hartree
pointgroup: C01 [X(C3H7N3O3)]
dipole: 0.4987652 1.4747907 0.2555358 debye
dipolederiv: -1.2195312 0.2118721 0.3970228 0.2048544 -0.4738842 -0.0842789 0.3259062 -0.0704401 -0.3772287 -0.699172 -0.0687684 0.0272272 -0.0766088 -1.0415815 -0.3021056 0.0798065 -0.3010352 -0.5577124 -0.6589163 0.0679974 -0.0593796 0.139587 -0.3562625 -0.1098834 0.1387772 -0.1629811 -0.9483242 -0.8028114 -0.2289219 0.0142164 -0.4024112 -0.3530455 0.1191397 -0.0034556 0.1270396 -0.3076704 -0.6531271 -0.0208551 0.1428402 0.0648801 -0.0883447 -0.0882622 0.23115 -0.0707937 -0.1116489 -1.166363 0.2224027 0.2206339 0.2542294 -0.4781677 0.0375012 0.267001 0.0435318 -0.7721259 0.332472 -0.0014835 -0.1485115 -0.1883776 0.0071018 -0.1511703 -0.400678 -0.1906728 0.0033635 1.773652 0.3327736 -0.3506755 0.3248277 1.3582289 0.4084887 -0.4247964 0.4004937 0.6317742 1.5064679 -0.2868687 -0.1223688 -0.3062702 0.3038246 0.2386295 -0.1948015 0.2620818 1.186207 -0.0549082 -0.0290737 0.0498479 -0.0323779 0.0372295 0.1282543 0.0866009 0.0829975 0.0138406 0.2234626 0.0312229 -0.0184264 0.1464899 0.0748874 -0.0279422 0.0323662 -0.0133182 0.1407146 0.2961882 -0.1308645 0.0148503 -0.051775 0.0228594 0.014024 -0.0263284 0.0745565 0.0937175 0.2750857 -0.0803175 -0.1645415 -0.0613157 0.126897 0.0005477 -0.0910952 -0.0200448 0.204726 0.3086137 0.0142566 0.0417847 0.0250924 0.2662596 -0.0683498 0.058235 -0.0658542 0.3169369 0.2588328 -0.0442256 0.039716 -0.0307233 0.2035288 -0.0842959 0.0491412 -0.0832826 0.3367568 0.2800542 0.0108535 -0.084236 -0.0101012 0.3904689 -0.0302967 -0.127829 -0.0122782 0.1466734 unknown
polarizability: 79.524192|0.6716625|57.9514139|-4.586264|9.8115656|54.6743569 unknown
InChI: InChI=1S/C3H7N3O3/c4-3(9)6(5)1-2(7)8/h7H,1,4-5H2
charge 0 multiplicity 1
16 atoms
O  3.037184 -0.277279 -0.436123
O  -1.540386 -1.461818 -0.890192
O  1.736072 0.334614 1.39004
N  -0.556856 0.579057 -0.288873
N  -0.682326 1.777403 0.459965
N  -2.756785 0.101373 0.372045
C  0.718002 0.169716 -0.869935
C  -1.636801 -0.343045 -0.295535
C  1.832808 0.089297 0.165653
H  1.04892 0.847862 -1.682159
H  0.557823 -0.828727 -1.320425
H  -0.611005 2.61928 -0.125832
H  -0.047967 1.779438 1.272073
H  -2.714709 1.005501 0.843925
H  -3.569599 -0.505559 0.403995
H  3.756125 -0.328612 0.250879
