program: Orca
programVersion: 5.0.2
elementType: O O O N C C C C C C C C C C C C C C C C C C C C C C C C H H H H H H H H H H H H H H H H H H H H H H H H H
charge: 0
multiplicity: 1
keywords: wb97x-d3
keywords: def2-TZVPP
keywords: def2/J RIJCOSX
keywords: DEFGRID2
keywords: scfconv7
keywords: smallprint printgap noloewdin
keywords: NOSOSCF
formula: C24H25NO3
InChI: InChI=1/C24H25NO3/c1-16(2)13-20-22(24(20,3)4)23(26)28-21(15-25)17-9-8-12-19(14-17)27-18-10-6-5-7-11-18/h5-14,20-22H,1-4H3
53 atoms
O  -1.023473 1.712827 0.304475
O  -1.6142 2.827566 -1.537246
O  -1.182102 -3.516485 -0.530834
N  -2.743325 0.728163 2.947177
C  1.492478 3.429351 0.358384
C  1.810213 2.150109 -0.354575
C  0.623171 2.990818 -0.80731
C  0.996661 3.361705 1.783621
C  2.33764 4.655424 0.102591
C  2.955249 2.011544 -1.276665
C  -0.768267 2.52397 -0.732671
C  3.836847 1.006837 -1.315068
C  3.823992 -0.180382 -0.401789
C  4.94778 1.002756 -2.321915
C  -2.339916 1.178402 0.405278
C  -2.4765 -0.085842 -0.406119
C  -2.549646 0.927651 1.832916
C  -1.74309 -1.212719 -0.04221
C  -3.290736 -0.098101 -1.526659
C  -1.83468 -2.359317 -0.816349
C  -3.373601 -1.255719 -2.290694
C  -2.649614 -2.38154 -1.946273
C  -0.229983 -3.548349 0.459572
C  1.003093 -2.939855 0.270802
C  -0.511761 -4.250397 1.62034
C  1.964148 -3.0407 1.266321
C  0.461846 -4.351538 2.605175
C  1.697809 -3.74512 2.433378
H  1.542602 1.258338 0.201435
H  0.784927 3.557604 -1.717636
H  0.25118 4.134265 1.982731
H  0.567789 2.399254 2.052056
H  1.834875 3.538262 2.460761
H  3.255237 4.616005 0.693292
H  2.621732 4.771482 -0.942479
H  1.795784 5.556932 0.395109
H  3.080239 2.813828 -1.998339
H  3.024957 -0.159356 0.336351
H  3.727333 -1.105418 -0.976855
H  4.77007 -0.255876 0.140799
H  5.924095 0.974602 -1.830458
H  4.89806 0.11448 -2.957763
H  4.923467 1.879297 -2.969498
H  -3.089475 1.911193 0.092721
H  -1.116616 -1.189615 0.841788
H  -3.855446 0.782315 -1.804027
H  -4.005639 -1.277972 -3.168522
H  -2.714823 -3.282767 -2.542972
H  1.21144 -2.397755 -0.643787
H  -1.479268 -4.719498 1.748434
H  2.929347 -2.571787 1.125039
H  0.24801 -4.903871 3.510993
H  2.453567 -3.823641 3.203887
elementType: O N C H
totalener: -1210.10483647 hartree
nucrepener: 2548.32554322 hartree
electener: -3758.43037969 hartree
oneelecener: -6707.68418269 hartree
twoeener: 2949.25380300 hartree
cpcmener: -0.03065251 hartree
kineticenergy: 1204.70950365 hartree
xcener: -118.583847414109 hartree
chargesum: -0.0000000
charge: -0.275060 -0.451438 -0.322978 -0.087165 0.109166 0.071270 -0.129080 -0.271176 -0.273586 -0.285064 0.422909 -0.039243 -0.268635 -0.219590 0.384455 0.002446 -0.236199 -0.206450 -0.200494 0.279465 -0.106289 -0.239875 0.249314 -0.198085 -0.198999 -0.142920 -0.138358 -0.173618 0.100339 0.086714 0.101099 0.088326 0.094144 0.097164 0.088160 0.098964 0.116978 0.080690 0.097445 0.104207 0.093587 0.093287 0.088332 0.135969 0.137122 0.143844 0.157729 0.146193 0.159504 0.147316 0.171425 0.158265 0.158473
qa: -0.2751 -0.4514 -0.3230 -0.0872 0.1092 0.0713 -0.1291 -0.2712 -0.2736 -0.2851 0.4229 -0.0392 -0.2686 -0.2196 0.3845 0.0024 -0.2362 -0.2065 -0.2005 0.2795 -0.1063 -0.2399 0.2493 -0.1981 -0.1990 -0.1429 -0.1384 -0.1736 0.1003 0.0867 0.1011 0.0883 0.0941 0.0972 0.0882 0.0990 0.1170 0.0807 0.0974 0.1042 0.0936 0.0933 0.0883 0.1360 0.1371 0.1438 0.1577 0.1462 0.1595 0.1473 0.1714 0.1583 0.1585
va: 2.1272 2.0613 2.0914 3.1061 3.6799 3.7377 3.8800 3.9097 3.9184 3.8690 4.1591 3.7721 3.9447 3.9215 3.7743 3.6596 4.0651 3.9499 3.9595 3.7724 3.9067 4.0055 3.7537 3.9595 3.9963 3.8659 3.8927 3.9347 1.0124 1.0344 1.0001 1.0119 1.0002 1.0015 1.0069 1.0011 1.0119 1.0051 0.9916 0.9974 0.9961 0.9969 1.0089 1.0191 1.0177 1.0104 0.9893 1.0073 0.9921 1.0044 0.9822 0.9894 0.9924
dispcorr: -0.027380725 hartree
energy: -1210.132217198799
dipole: 30.89852 -29.27021 1.62831 12.56512 -12.67096 -0.10584 -2.42200 1.81162 -0.61039
magnitude: 1.74218 au
magnitude: 4.42826 debye
