program: Orca
programVersion: 5.0.2
elementType: O O O N C C C C C C C C C C C C C C C C C C C C C C C C H H H H H H H H H H H H H H H H H H H H H H H H H
charge: 0
multiplicity: 1
keywords: wb97x-d3
keywords: def2-TZVPP
keywords: def2/J RIJCOSX
keywords: DEFGRID2
keywords: scfconv7
keywords: smallprint printgap noloewdin
keywords: NOSOSCF
formula: C24H25NO3
InChI: InChI=1/C24H25NO3/c1-16(2)13-20-22(24(20,3)4)23(26)28-21(15-25)17-9-8-12-19(14-17)27-18-10-6-5-7-11-18/h5-14,20-22H,1-4H3
53 atoms
O  -0.89276 2.082713 0.337678
O  0.836715 1.257651 -0.810362
O  -1.699775 -3.439483 -1.559101
N  -4.160178 2.242732 -0.070149
C  2.405461 2.272096 1.741511
C  2.628025 3.204812 0.602884
C  1.208138 2.82086 0.970875
C  2.806302 0.824661 1.596211
C  2.542383 2.78763 3.153566
C  3.088658 4.603227 0.809448
C  0.422975 1.971775 0.067868
C  2.682356 5.659261 0.099987
C  1.674548 5.57312 -1.004413
C  3.209119 7.034061 0.376517
C  -1.764114 1.260539 -0.423109
C  -1.725178 -0.186532 0.013293
C  -3.10079 1.821819 -0.210054
C  -1.675188 -1.182414 -0.948766
C  -1.747978 -0.511329 1.364505
C  -1.671796 -2.515415 -0.558924
C  -1.728204 -1.845493 1.738465
C  -1.697688 -2.85515 0.787342
C  -1.060786 -4.643282 -1.43273
C  0.211214 -4.756828 -0.884466
C  -1.712617 -5.754272 -1.948829
C  0.822154 -6.002256 -0.850048
C  -1.083747 -6.990426 -1.918786
C  0.18208 -7.121888 -1.364666
H  2.986591 2.725864 -0.305787
H  0.628244 3.567909 1.50091
H  2.81323 0.481944 0.564698
H  3.815238 0.685542 1.9879
H  2.142884 0.17067 2.16512
H  2.204461 3.818266 3.261112
H  1.956914 2.175738 3.842177
H  3.583394 2.743125 3.479709
H  3.830497 4.758755 1.588389
H  0.757151 6.103879 -0.733728
H  2.053031 6.057501 -1.908226
H  1.403893 4.551191 -1.265301
H  3.908405 7.047897 1.21269
H  3.721638 7.442719 -0.498552
H  2.394294 7.725853 0.60687
H  -1.549895 1.339777 -1.494138
H  -1.645503 -0.930056 -2.002153
H  -1.78627 0.261893 2.121552
H  -1.749951 -2.10933 2.787431
H  -1.702293 -3.891041 1.101189
H  0.728473 -3.888913 -0.494352
H  -2.701373 -5.647988 -2.377943
H  1.812586 -6.092156 -0.422758
H  -1.592073 -7.85487 -2.326374
H  0.668479 -8.088109 -1.337482
elementType: O N C H
totalener: -1210.10610747 hartree
nucrepener: 2428.59147327 hartree
electener: -3638.69758075 hartree
oneelecener: -6468.53853409 hartree
twoeener: 2829.84095335 hartree
cpcmener: -0.02988837 hartree
kineticenergy: 1204.70749634 hartree
xcener: -118.582400902384 hartree
chargesum: -0.0000000
charge: -0.284685 -0.448176 -0.325053 -0.089028 0.147738 -0.009075 -0.106389 -0.275335 -0.285778 -0.295643 0.370587 -0.012464 -0.240656 -0.226712 0.403523 0.030485 -0.225082 -0.233242 -0.225487 0.269377 -0.137622 -0.179020 0.287934 -0.197831 -0.249551 -0.143720 -0.121004 -0.183695 0.106573 0.096717 0.093860 0.096986 0.097180 0.094129 0.097679 0.099481 0.121597 0.101033 0.100723 0.080657 0.089258 0.096358 0.093502 0.140400 0.134224 0.147462 0.160228 0.158431 0.158550 0.145848 0.159501 0.157260 0.157964
qa: -0.2847 -0.4482 -0.3251 -0.0890 0.1477 -0.0091 -0.1064 -0.2753 -0.2858 -0.2956 0.3706 -0.0125 -0.2407 -0.2267 0.4035 0.0305 -0.2251 -0.2332 -0.2255 0.2694 -0.1376 -0.1790 0.2879 -0.1978 -0.2496 -0.1437 -0.1210 -0.1837 0.1066 0.0967 0.0939 0.0970 0.0972 0.0941 0.0977 0.0995 0.1216 0.1010 0.1007 0.0807 0.0893 0.0964 0.0935 0.1404 0.1342 0.1475 0.1602 0.1584 0.1585 0.1458 0.1595 0.1573 0.1580
va: 2.1128 2.0619 2.0804 3.1136 3.7103 3.8198 3.8143 3.8937 3.9087 3.8931 4.1701 3.7082 3.9361 3.9315 3.7230 3.6112 4.0789 4.0839 3.9660 3.7673 3.9164 3.9200 3.6861 3.9150 4.0090 3.8900 3.8857 3.9050 1.0234 1.0298 1.0167 1.0018 1.0004 1.0019 1.0031 0.9998 1.0033 0.9982 1.0000 1.0138 1.0063 0.9965 0.9965 1.0189 1.0189 1.0129 0.9907 0.9948 0.9968 1.0083 0.9903 0.9894 0.9904
dispcorr: -0.025367595 hartree
energy: -1210.131475069411
dipole: 26.76063 -24.92036 1.84027 21.81407 -22.26632 -0.45225 10.40153 -9.46821 0.93333
magnitude: 2.11240 au
magnitude: 5.36929 debye
