program: Orca
programVersion: 5.0.2
elementType: O O O N C C C C C C C C C C C C C C C C C C C C C C C C H H H H H H H H H H H H H H H H H H H H H H H H H
charge: 0
multiplicity: 1
keywords: wb97x-d3
keywords: def2-TZVPP
keywords: def2/J RIJCOSX
keywords: DEFGRID2
keywords: scfconv7
keywords: smallprint printgap noloewdin
keywords: NOSOSCF
formula: C24H25NO3
InChI: InChI=1/C24H25NO3/c1-16(2)13-20-22(24(20,3)4)23(26)28-21(15-25)17-9-8-12-19(14-17)27-18-10-6-5-7-11-18/h5-14,20-22H,1-4H3
53 atoms
O  -0.958923 2.08394 0.278832
O  0.770434 1.243258 -0.85655
O  -1.686639 -3.55166 -1.34614
N  -4.245296 2.061084 0.013874
C  2.334317 2.44408 1.624273
C  2.547138 3.291824 0.41858
C  1.13162 2.924083 0.816101
C  2.746158 0.993377 1.583263
C  2.469468 3.063191 2.994465
C  2.993508 4.7066 0.516084
C  0.353257 1.999136 -0.015837
C  2.577942 5.696134 -0.278351
C  1.576445 5.505016 -1.375567
C  3.084145 7.096157 -0.112291
C  -1.818256 1.189106 -0.409333
C  -1.700914 -0.234562 0.087389
C  -3.171925 1.694635 -0.164271
C  -1.689875 -1.269585 -0.83388
C  -1.619267 -0.500554 1.448986
C  -1.619164 -2.583535 -0.390098
C  -1.533276 -1.816565 1.875648
C  -1.539947 -2.865497 0.967618
C  -0.995962 -4.726076 -1.210102
C  -1.646858 -5.886786 -1.6028
C  0.321505 -4.764344 -0.769624
C  -0.969759 -7.097127 -1.559911
C  0.981588 -5.983839 -0.720741
C  0.343297 -7.152838 -1.114126
H  2.909356 2.749024 -0.451919
H  0.545361 3.70236 1.291683
H  2.743417 0.57412 0.579578
H  3.761331 0.891369 1.971702
H  2.094042 0.379259 2.207714
H  3.511473 3.048851 3.321276
H  2.126277 4.097273 3.024829
H  1.888199 2.501344 3.727759
H  3.728012 4.933165 1.284246
H  1.341575 4.459731 -1.569854
H  0.64048 6.01963 -1.138965
H  1.939535 5.943333 -2.308576
H  3.599102 7.438166 -1.014034
H  2.257969 7.793022 0.05289
H  3.775228 7.189038 0.725529
H  -1.646845 1.227161 -1.490437
H  -1.741058 -1.062597 -1.896351
H  -1.626983 0.30306 2.174396
H  -1.472256 -2.03473 2.933592
H  -1.489929 -3.886775 1.322842
H  -2.672714 -5.839552 -1.946509
H  0.835562 -3.857782 -0.474618
H  -1.477426 -8.00102 -1.871387
H  2.008148 -6.015177 -0.379037
H  0.867622 -8.098661 -1.077454
elementType: O N C H
totalener: -1210.10599350 hartree
nucrepener: 2430.03043419 hartree
electener: -3640.13642769 hartree
oneelecener: -6471.41746092 hartree
twoeener: 2831.28103323 hartree
cpcmener: -0.03004244 hartree
kineticenergy: 1204.70553413 hartree
xcener: -118.581921704003 hartree
chargesum: -0.0000000
charge: -0.284475 -0.447023 -0.325511 -0.088150 0.149072 -0.009054 -0.105541 -0.275356 -0.285355 -0.297853 0.367864 -0.010079 -0.242309 -0.226887 0.404781 0.033430 -0.227560 -0.233921 -0.226644 0.264922 -0.136952 -0.176726 0.281113 -0.246745 -0.191943 -0.122865 -0.145705 -0.181745 0.105917 0.097031 0.094330 0.097709 0.095718 0.099472 0.093734 0.098206 0.121644 0.080926 0.101529 0.100492 0.096459 0.093697 0.089093 0.140801 0.134403 0.147422 0.160131 0.158530 0.145958 0.159052 0.157917 0.159184 0.157863
qa: -0.2845 -0.4470 -0.3255 -0.0882 0.1491 -0.0091 -0.1055 -0.2754 -0.2854 -0.2979 0.3679 -0.0101 -0.2423 -0.2269 0.4048 0.0334 -0.2276 -0.2339 -0.2266 0.2649 -0.1370 -0.1767 0.2811 -0.2467 -0.1919 -0.1229 -0.1457 -0.1817 0.1059 0.0970 0.0943 0.0977 0.0957 0.0995 0.0937 0.0982 0.1216 0.0809 0.1015 0.1005 0.0965 0.0937 0.0891 0.1408 0.1344 0.1474 0.1601 0.1585 0.1460 0.1591 0.1579 0.1592 0.1579
va: 2.1135 2.0615 2.0790 3.1136 3.7113 3.8200 3.8137 3.8932 3.9071 3.8948 4.1745 3.7055 3.9363 3.9317 3.7211 3.6091 4.0795 4.0879 3.9613 3.7695 3.9145 3.9166 3.6907 4.0086 3.9128 3.8859 3.8923 3.9035 1.0240 1.0298 1.0162 1.0020 1.0008 0.9998 1.0019 1.0031 1.0034 1.0141 0.9979 1.0003 0.9965 0.9963 1.0063 1.0187 1.0185 1.0131 0.9907 0.9947 1.0082 0.9964 0.9891 0.9904 0.9905
dispcorr: -0.025488648 hartree
energy: -1210.131482145134
dipole: 26.56516 -24.65735 1.90781 23.04091 -23.35503 -0.31412 8.42603 -7.58470 0.84133
magnitude: 2.10861 au
magnitude: 5.35967 debye
