program: Gaussian 09
title: 000007742
version: EM64L-G09RevD.01
frameworkgroup: C1[X(C7H12O2)]
method: RPBEPBE
basis: SDD
operation: Freq
keyword: #pfreq=noraman
keyword: PBEPBE/SDD
title: #p freq=noraman PBEPBE/SDD
converged: NO YES NO NO
title: Mulliken charges:
elementType: O O C C C C C C C H H H H H H H H H H H H
charge: -0.235803 -0.204682 -0.012057 -0.462111 -0.381676 -0.539652 -0.350740 0.200580 -0.694756 0.223050 0.234049 0.233719 0.211637 0.196555 0.252201 0.262033 0.188743 0.237800 0.204970 0.214522 0.221618
chargesum: 0.00000
title: Mulliken charges with hydrogens summed into heavy atoms:
elementType: O O C C C C C C C
charge: -0.235803 -0.204682 0.210993 0.005658 0.026516 -0.025419 0.075803 0.200580 -0.053646
polarizability: 9.91138666e+01 -3.96013574e+00 7.64668398e+01 -1.92124804e+00 1.19916726e+00 6.20878158e+01
1716.lowfreq: -7.9992 -7.1785 -0.0006 0.0006 0.0008 6.7549 67.8729 87.8107 103.8100
frequency: 67.7973 87.7626 103.8039 139.5482 178.3169 228.8236 297.5068 348.6361 448.9334 491.6991 510.2705 607.2440 623.1436 736.8072 771.6689 830.7539 854.5359 875.9838 895.1416 955.9884 1005.8194 1030.8457 1059.5953 1075.9616 1083.4791 1110.1439 1142.7827 1169.6193 1202.2062 1231.8574 1255.8583 1278.9258 1291.6786 1303.4002 1314.4369 1346.8760 1369.5932 1392.8866 1445.7143 1447.1344 1470.5025 1475.5698 1478.6283 1486.1064 1704.6099 2966.7363 2973.9378 2977.5523 2986.4874 3010.7137 3014.7904 3025.0061 3045.9278 3072.9882 3077.0046 3087.5303 3102.4689
redmass: 3.6518 1.6952 3.4655 3.6440 2.0657 1.1374 2.9298 4.3530 2.8688 3.2583 2.5818 3.2463 5.1761 1.2895 2.9399 1.5479 4.4613 1.4536 1.9330 2.1003 1.8673 2.4938 2.4309 2.0381 2.5814 2.2702 1.9912 1.7803 1.3499 1.3102 1.2773 1.3255 1.1657 1.4081 1.1961 1.4230 1.7200 1.2224 1.0807 1.0851 1.0947 1.0493 1.0442 1.0817 12.5425 1.0598 1.0368 1.0658 1.0858 1.0656 1.0636 1.0941 1.1004 1.1011 1.0990 1.1008 1.0991
irintensity: 1.5968 1.0504 2.1563 0.4928 0.5283 0.0374 0.3140 0.2887 3.7187 4.7983 1.3575 1.0968 6.6712 10.6273 4.3183 11.2665 89.6295 2.8977 9.9314 22.8132 16.2138 21.3294 35.4579 14.3977 164.1162 31.5599 38.9813 4.8725 0.5262 0.7017 0.7082 7.1060 1.4722 1.2775 3.5895 5.3127 10.7744 8.1523 9.0242 11.1881 11.4944 4.4569 11.4689 15.4880 349.8181 14.3991 43.2642 26.3743 25.9028 12.4031 24.1879 20.9814 6.4952 78.0979 47.4022 25.3189 16.9347
temp: 298.150 k
press: 1.00000 atm
elementType: 8 8 6 6 6 6 6 6 6 1 1 1 1 1 1 1 1 1 1 1 1
symmnumber: 1
zpe: 469951.4 jmol-1
zpe.correction: 0.178995 hartree
zpe.thermalcorrener: 0.188532 hartree
zpe.thermalcorrenthalpy: 0.189476 hartree
zpe.thermalcorrgfe: 0.143858 hartree
zpe.sumelectzpe: -423.678777 hartree
zpe.sumelectthermal: -423.669241 hartree
zpe.sumelectthermalent: -423.668296 hartree
zpe.sumelectthermalfe: -423.713914 hartree
dipole: -1.9133 4.7688 0.5731
dipole: 5.1702
quadrupole: -59.1968 -59.5284 -52.9418
quadrupole: 9.4223 0.9884 -0.0550
quadrupole: -1.9745 -2.3060 4.2805 9.4223 0.9884 -0.0550
hfenergy: -423.8577723 hartree
pointgroup: C01 [X(C7H12O2)]
dipole: 0.8016644 1.8564917 -0.2198716 debye
dipolederiv: -1.5107888 -0.3810933 0.1482903 -0.073368 -0.5583423 0.0017004 0.1500786 0.0432745 -0.2981509 -0.920685 -0.303131 0.0829822 -0.4868202 -0.8721021 0.081076 0.1325938 0.0822187 -0.3506697 0.5500065 0.1174494 -0.0192081 0.4056541 0.4707288 -0.0732206 -0.0172304 -0.0500074 0.3660125 -0.1326529 0.1048067 0.0251466 -0.0192512 -0.0153319 -0.0464296 0.0362668 -0.0142102 0.1262955 -0.0758042 0.0332307 -0.0332 0.0441539 0.0868828 -0.0290377 -0.0548896 -0.0323056 0.0669449 -0.0832383 0.0748475 0.0008345 0.1177954 -0.3513708 0.0290851 0.0330378 0.0297624 0.1471381 0.0492915 0.0135633 -0.0326488 -0.0155809 0.0854733 -0.032338 -0.0723678 -0.0383117 0.1378585 1.8812775 0.494955 -0.2410186 0.1992253 1.1543985 -0.0804893 -0.285687 -0.1453007 0.2383839 -0.0525708 0.0348548 -0.0373166 0.058618 0.0830828 -0.0088502 -0.0129987 -0.0117104 0.0603992 0.0059599 -0.0190069 0.0165534 -0.0785566 -0.0103169 0.0055902 0.0376001 0.0385713 -0.1743816 0.0821589 -0.0373674 0.0082883 -0.035262 -0.1084523 0.0685395 0.002957 0.1001233 0.04869 0.0480062 -0.0213122 -0.0572511 -0.0200506 0.0783521 -0.0031233 -0.0446625 -0.0611021 -0.1222041 0.0437547 0.0109953 0.0427052 0.0297947 0.0697297 0.0379907 0.0348883 0.0085124 -0.1446274 0.0010146 -0.0813357 0.0065028 -0.0646798 -0.1515031 0.002454 0.0077073 0.021457 0.0790208 0.0633974 -0.0219023 -0.0480673 -0.0014493 0.0733278 0.0113678 -0.1024765 0.0253003 -0.0554588 -0.025675 0.0175018 0.0734897 0.0064652 0.0888601 -0.0165127 0.1034636 -0.0487849 0.0302594 0.0350436 0.0222578 -0.0033249 0.0168534 0.0544326 0.0734843 0.0163231 0.0346099 -0.1969222 0.0357926 -0.0823293 -0.0110864 -0.0693595 -0.0963325 -0.0109468 -0.0010227 0.0089989 0.07837 0.0170612 -0.0747346 -0.0153166 -0.1477762 -0.1388698 0.0067544 -0.0139656 0.0262024 0.0803141 0.0690327 -0.0173903 0.0462407 -0.0135297 0.0815139 0.0524538 -0.0212144 0.0620028 -0.1680115 -0.0803823 0.1151407 0.0474047 0.147124 -0.0241605 -0.0695481 0.0715991 -0.0793008 0.0507393 unknown
polarizability: 99.3176637|3.3791464|76.2809621|-1.7980184|-1.1176334|62.0698963 unknown
InChI: InChI=1S/C7H12O2/c1-2-3-6-4-5-7(8)9-6/h6H,2-5H2,1H3
charge 0 multiplicity 1
21 atoms
O  -0.507936 -0.748661 -0.166263
O  -2.667745 -1.518757 0.21501
C  0.157754 0.584039 -0.409762
C  -0.843842 1.622278 0.1592
C  1.540384 0.563973 0.242895
C  -2.214561 0.936865 -0.024066
C  2.506496 -0.464784 -0.386394
C  -1.895746 -0.564463 0.034324
C  3.883716 -0.479471 0.308751
H  0.246889 0.681775 -1.510753
H  -0.765564 2.590434 -0.361918
H  -0.636136 1.787477 1.232223
H  1.417373 0.353255 1.323746
H  1.972167 1.583678 0.160259
H  -2.656121 1.153752 -1.015536
H  -2.966185 1.193659 0.738125
H  2.63505 -0.234415 -1.463869
H  2.042599 -1.467212 -0.331964
H  4.37416 0.510931 0.24945
H  3.784496 -0.741904 1.378774
H  4.559653 -1.219051 -0.157133
