program: Gaussian 16
title: Title CardRequired
version: ES64L-G16RevB.01
basis: def2TZVP
frameworkgroup: C1[X(C5H10NO2)]
method: RB3LYP
operation: FOpt
keyword: #p
keyword: opt
keyword: b3lyp
keyword: scrf=(smd,solvent=water)
keyword: def2tzvp
keyword: em=gd3bj
title: #p opt b3lyp scrf=(smd,solvent=water) def2tzvp em=gd3bj
title: Title Card Required
nucrepener: 418.6105350567
basis: NPDir=0 NMtPBC= 1 NCelOv= 1 NCel= 1 NClECP= 1 NCelD= 1
basis: NCelK= 1 NCelE2= 1 NClLst= 1 CellRange= 0.0.
basis: One-electron integrals computed using PRISM.
basis: One-electron integral symmetry used in STVInt
converged: YES YES YES YES
title: Mulliken charges:
elementType: C N C C C H H H H H H H H H H C O O
charge: -0.159033 -0.239362 -0.084886 -0.376170 -0.372561 0.065330 0.151755 0.104533 0.090879 0.116408 0.114104 0.096029 0.119186 0.102227 0.116128 0.250092 -0.521498 -0.573158
chargesum: -1.00000
charge: -0.069383 -0.167303 -0.070876 -0.383848 -0.383710 0.109712 0.094686 0.095161 0.109877 0.116661 0.112903 0.118468 0.116636 0.118648 0.112861 0.365106 -0.697875 -0.697725
dipole: -11.8374 1.4997 2.1482
dipole: 12.1239
quadrupole: -73.4743 -60.6222 -52.6769
quadrupole: 1.6123 2.3519 -0.3737
quadrupole: -11.2165 1.6356 9.5809 1.6123 2.3519 -0.3737
hfenergy: -402.1234867 hartree
pointgroup: C01 [X(C5H10N1O2)]
dipole: 0.0779769 0.4193554 4.750796 debye
InChI: InChI=1/C5H10NO2/c1-3-6(4-2)5(7)8/h3-4H2,1-2H3
charge -1 multiplicity 1
18 atoms
C  -1.23602186 0.80839535 -0.11680956
N  -0.00037643 0.679844 -0.88194536
C  1.26254798 0.6854752 -0.1517329
C  -1.82584155 -0.50406523 0.39366452
C  1.72197311 -0.67555238 0.36588458
H  -1.02560287 1.46552099 0.72904308
H  -1.97432364 1.3148112 -0.73735083
H  2.03226909 1.09956545 -0.80166334
H  1.1486638 1.37385591 0.68780484
H  -2.77770548 -0.31430562 0.89629923
H  -2.01067686 -1.19372742 -0.43127543
H  -1.16045455 -0.99195912 1.10641044
H  2.70372543 -0.58329215 0.83742837
H  1.02982734 -1.07740164 1.10634586
H  1.80519642 -1.39336218 -0.45166513
C  -0.03850566 0.24205797 -2.19937213
O  -1.17491022 0.12913955 -2.75871157
O  1.06766974 0.00345456 -2.77953894
