program: Gaussian 09
title: 000067297
version: EM64L-G09RevD.01
frameworkgroup: C1[X(C8H11NO)]
method: RPBEPBE
basis: SDD
operation: Freq
keyword: #p
keyword: freq=noraman
keyword: PBEPBE/SDD
title: #p freq=noraman PBEPBE/SDD
converged: NO NO NO NO
title: Mulliken charges:
elementType: O N C C C C C C C C H H H H H H H H H H H
charge: -0.269691 -0.712008 0.401617 0.155974 -0.605857 0.532272 -0.328191 -0.454621 -0.793205 -0.537452 0.220336 0.230840 0.211817 0.236991 0.236797 0.207757 0.299311 0.300570 0.214206 0.214236 0.238303
chargesum: 0.00000
title: Mulliken charges with hydrogens summed into heavy atoms:
elementType: O N C C C C C C C C
charge: -0.269691 -0.112127 0.401617 0.155974 -0.385521 0.532272 -0.097351 -0.242804 -0.111661 0.129293
polarizability: 1.38821230e+02 -1.28343995e+00 1.05558376e+02 1.42299021e-03 2.25589650e-03 5.07193967e+01
1716.lowfreq: -9.9458 -0.0008 -0.0006 0.0005 12.1495 13.3841 81.3341 116.7757 142.6442
frequency: 81.3165 116.7723 142.6439 207.6484 209.7640 255.1850 273.9785 276.8146 321.0316 356.4136 363.7829 442.0046 457.6325 492.0994 574.3859 581.6597 708.7669 724.5533 731.9867 791.5973 862.9153 902.5318 939.9306 991.4543 998.4885 1046.3703 1048.1630 1117.5232 1126.3700 1151.2322 1189.8879 1222.3813 1273.2204 1332.5837 1385.3681 1399.2512 1436.3882 1444.3655 1456.7781 1466.3525 1475.0307 1483.2326 1508.9640 1593.1904 1633.1708 1645.1701 2943.4253 2979.5325 3023.9219 3059.4004 3084.8384 3111.0259 3112.0651 3119.9309 3156.1587 3574.5135 3716.0758
redmass: 2.8309 1.1155 3.3669 2.8220 3.1159 1.1219 2.7506 1.2533 1.0470 3.3992 5.0291 2.6846 5.1722 3.6747 4.3786 2.7498 5.1901 2.9493 5.3409 1.4748 1.5529 1.3838 2.9767 1.5881 5.8472 1.5295 1.4766 1.2625 2.0214 1.4695 1.4910 2.3681 1.5506 2.8872 4.1854 1.3848 1.5742 1.4559 1.0459 1.0501 1.2123 1.3593 2.3786 7.5330 1.4623 2.9470 1.0337 1.0360 1.1030 1.0969 1.1004 1.0980 1.0910 1.0887 1.0938 1.0446 1.1041
irintensity: 7.3361 1.2798 1.6885 11.1899 3.9282 6.7755 1.8821 311.7241 0.9663 2.4679 0.4496 4.9320 2.5536 3.7729 1.0816 4.5668 22.6679 2.9985 2.6356 51.2310 30.6816 0.0603 1.8118 12.8776 41.6987 9.9596 11.6520 0.2323 31.4645 1.4493 6.2003 205.8372 0.1706 8.2749 11.6140 21.9244 26.8193 0.2034 11.2027 12.2324 48.3475 30.2686 210.8197 6.7217 36.4260 163.8343 82.9718 33.3728 58.7346 19.8458 20.9788 32.8614 26.2065 20.7551 15.9307 56.8353 17.9809
temp: 298.150 k
press: 1.00000 atm
elementType: 8 7 6 6 6 6 6 6 6 6 1 1 1 1 1 1 1 1 1 1 1
symmnumber: 1
zpe: 455306.1 jmol-1
zpe.correction: 0.173417 hartree
zpe.thermalcorrener: 0.183932 hartree
zpe.thermalcorrenthalpy: 0.184876 hartree
zpe.thermalcorrgfe: 0.138225 hartree
zpe.sumelectzpe: -440.663096 hartree
zpe.sumelectthermal: -440.652581 hartree
zpe.sumelectthermalent: -440.651637 hartree
zpe.sumelectthermalfe: -440.698288 hartree
dipole: 1.3032 -1.2730 0.0185
dipole: 1.8219
quadrupole: -43.8444 -52.6232 -64.9588
quadrupole: 3.8618 0.0894 -0.0064
quadrupole: 9.9644 1.1856 -11.1500 3.8618 0.0894 -0.0064
hfenergy: -440.8365129 hartree
pointgroup: C01 [X(C8H11N1O1)]
dipole: -0.5133119 0.5002201 0.0072639 debye
dipolederiv: -1.6276618 -0.293016 0.0002092 -0.1896956 -0.3914002 0.0000665 -0.0003187 0.0002935 -0.2806044 -1.5869216 0.0621807 -0.0031562 0.0719736 -0.088979 0.000268 -0.009511 0.0004553 -0.7746918 0.023755 0.0879384 0.0002477 -0.2834341 0.3304482 -0.0002112 0.0004677 -0.0010285 -0.0100462 1.2410302 0.1018304 -0.0000689 -0.0536824 -0.3151323 0.0000725 0.0004837 -0.0000388 -0.0011369 -0.2640425 -0.081433 -0.0001039 0.3588455 0.0266227 0.0000881 0.0002885 0.0003017 -0.2599867 1.6158327 -0.0931676 0.0017224 -0.0241013 -0.1198274 -0.0001016 0.0012767 0.0001316 0.1431049 -0.0093806 -0.2715916 0.0000554 0.1691569 0.0930573 -0.0000676 -0.0002043 0.0000343 -0.167089 -0.3358363 0.2328709 0.0000061 -0.3590982 0.0736307 0.0000447 0.0003251 -0.0002965 -0.2549853 -0.0065063 0.1503319 0.0003673 0.1207637 -0.0199989 0.0003097 -0.0002065 0.0014411 0.0624691 0.5845467 0.1798399 -0.000111 0.5062394 0.4703714 -0.0000694 -0.0002212 -0.0001651 0.339879 -0.0130015 -0.1017592 0.0000397 -0.1059475 -0.0741192 -0.0000091 -0.0000392 -0.0001899 0.1624841 0.0291542 -0.1034413 0.0000105 -0.1090876 -0.0489346 -0.0000307 0.0000118 -0.0000406 0.1593252 -0.0078076 0.1062282 -0.0000001 0.1016184 -0.088523 -0.0001162 0.0000406 0.0000521 0.1713497 0.0253865 0.0590331 0.1096618 0.0317887 0.041134 0.0044963 0.1147221 -0.0569753 -0.0402703 0.0273874 0.0593331 -0.1089122 0.0327319 0.0397793 -0.003573 -0.1141368 0.057973 -0.0427933 -0.0313195 -0.1797392 -0.0012128 -0.0651353 -0.076718 -0.0009287 -0.0006262 -0.0013462 0.1023286 0.1932578 -0.0135951 0.0006448 -0.0224086 0.1059189 -0.0008486 0.0036559 -0.0016706 0.3904836 0.1994298 0.0037433 0.0007298 0.0135154 0.107543 0.0006888 0.003882 0.001237 0.3909227 0.0576206 0.037794 0.0672953 -0.1343635 -0.0684233 -0.1102414 -0.0111889 -0.1220075 -0.1045154 0.0575826 0.0379163 -0.0675654 -0.1341779 -0.0680596 0.1102039 0.0111494 0.1218665 -0.1046545 -0.1725057 0.0187031 0.0001405 0.0744985 0.07161 -0.000041 0.0001494 -0.0000272 0.118427 unknown
polarizability: 138.8242251|-1.2440257|105.5553816|-0.0014203|-0.0022576|50.7193967 unknown
InChI: InChI=1S/C8H11NO/c1-6-5-7(9)3-4-8(6)10-2/h3-5H,9H2,1-2H3
charge 0 multiplicity 1
21 atoms
O  2.296802 -0.072671 0.000601
N  -3.348044 0.347536 -0.000649
C  0.122828 -1.087591 0.000129
C  0.89455 0.110834 0.000387
C  -1.282808 -0.982577 0.000173
C  -1.947501 0.278777 0.00043
C  0.255041 1.370913 0.00062
C  -1.154905 1.456245 0.000703
C  0.818742 -2.433995 0.000283
C  3.121387 1.128576 -0.000761
H  -1.878004 -1.905249 -0.000221
H  0.839477 2.296659 0.000759
H  -1.637752 2.441211 0.000691
H  1.478065 -2.539808 -0.880893
H  1.468059 -2.544837 0.888343
H  0.086802 -3.260365 -0.006006
H  -3.823384 1.244126 0.004722
H  -3.909475 -0.497769 0.004491
H  2.943065 1.747439 0.902309
H  2.941738 1.746335 -0.904321
H  4.162918 0.77201 -0.00129
