program: Gaussian 09
title: 000007784
version: EM64L-G09RevD.01
frameworkgroup: C1[X(C14H26O4)]
method: RPBEPBE
basis: SDD
operation: Freq
keyword: #pfreq=noraman
keyword: PBEPBE/SDD
title: #p freq=noraman PBEPBE/SDD
converged: YES YES NO NO
title: Mulliken charges:
elementType: O O O O C C C C C C C C C C C C C C H H H H H H H H H H H H H H H H H H H H H H H H H H
charge: -0.264695 -0.264707 -0.241381 -0.241465 -0.375776 -0.375127 -0.503464 -0.503860 -0.373046 -0.372717 -0.257336 -0.256991 0.249342 0.248990 -0.348382 -0.349194 -0.689053 -0.689518 0.207731 0.238836 0.207235 0.239165 0.226274 0.232518 0.226739 0.232657 0.213323 0.203326 0.213383 0.203998 0.219741 0.222356 0.220330 0.221661 0.191646 0.200698 0.192500 0.200017 0.213994 0.219019 0.213954 0.214212 0.218927 0.214141
chargesum: 0.00000
title: Mulliken charges with hydrogens summed into heavy atoms:
elementType: O O O O C C C C C C C C C C C C C C
charge: -0.264695 -0.264707 -0.241381 -0.241465 0.070790 0.071273 -0.044672 -0.044464 0.043603 0.044664 0.184760 0.185001 0.249342 0.248990 0.043962 0.043322 -0.042086 -0.042238
polarizability: 1.96628339e+02 1.36667372e+00 1.55936392e+02 3.80221180e-01 -7.20003337e+00 1.39869529e+02
1716.lowfreq: -4.9313 0.0005 0.0007 0.0010 3.4510 7.7405 15.1674 20.5306 30.1914
frequency: 14.9847 19.3940 30.1277 36.7745 45.3623 51.3330 54.1877 79.6152 86.1189 95.3065 97.4880 111.8298 127.3997 168.3059 172.7136 191.6205 199.6261 232.1922 234.1279 234.8058 243.2154 268.4857 306.6592 328.5486 403.1175 407.3265 422.1371 451.0620 482.2358 585.4615 587.1338 659.2777 669.5951 737.2958 740.8257 786.4236 795.6863 796.8634 808.5097 819.4106 826.6399 898.3376 907.3790 911.2099 914.0999 929.8702 930.6218 947.6253 989.3923 1036.4046 1040.4329 1040.7274 1053.3632 1054.9767 1081.9428 1082.5477 1123.7556 1123.8058 1136.1440 1144.6364 1145.7583 1147.6435 1210.5115 1210.9458 1211.4384 1219.1868 1242.7499 1266.1903 1270.0121 1270.7305 1272.0335 1283.6875 1284.0302 1286.1248 1321.2976 1322.8288 1325.3734 1342.6416 1344.0461 1367.6431 1371.7985 1376.2876 1390.8903 1392.7598 1447.2936 1449.8288 1460.7241 1464.0201 1469.7467 1470.7941 1471.0271 1472.5706 1474.2683 1479.2895 1480.3961 1483.5089 1488.9514 1492.6458 1635.9123 1636.4644 2966.2186 2966.6869 2974.2186 2974.7797 2987.3670 2988.0555 2988.2756 2993.2807 2998.0152 2998.8420 3008.9294 3009.7554 3009.8646 3010.0681 3039.6312 3039.8162 3041.0382 3063.3088 3065.4799 3066.9957 3073.0263 3075.4001 3076.6564 3076.9932 3084.0430 3086.2226
redmass: 4.5637 4.5935 5.5362 3.7050 7.4803 2.1581 2.9536 2.8699 1.9353 3.0338 3.1177 2.1105 2.1582 2.8921 2.4570 2.7818 3.4961 1.1991 3.8066 3.6234 1.1292 2.5196 2.7610 3.3868 2.8908 2.9748 3.3742 3.4088 4.4662 4.6258 4.2501 1.9774 3.5950 1.0700 1.0687 2.1141 1.1406 1.1620 5.5110 2.6431 3.0702 1.8142 1.8097 2.1403 2.8107 1.1656 1.1642 5.1702 3.0795 2.4056 3.3368 3.2224 2.1154 2.9607 2.1741 2.1726 2.6165 2.5913 2.1889 1.5533 1.4924 1.5303 2.0488 1.3584 1.3563 1.6618 1.5422 1.2111 1.2721 1.2028 1.2266 1.2345 1.1260 1.0846 1.3289 1.3106 1.1764 1.4406 1.4498 1.5136 1.5732 1.5525 1.2176 1.2176 1.0872 1.0903 1.0780 1.0820 1.0777 1.0767 1.0776 1.0713 1.0465 1.0691 1.0424 1.0635 1.0899 1.0871 10.4319 10.3109 1.0595 1.0588 1.0371 1.0362 1.0606 1.0600 1.0601 1.0620 1.0570 1.0570 1.0614 1.0990 1.0613 1.0990 1.1019 1.0996 1.1031 1.1036 1.1035 1.1041 1.1045 1.1024 1.1006 1.1006 1.1006 1.1010
irintensity: 0.8837 0.3649 0.6857 0.0066 0.0264 0.5623 0.1241 0.7355 0.2700 1.5217 0.2217 0.0106 0.0111 0.1517 9.1191 3.5102 1.3563 0.6410 4.4980 5.9417 0.0569 2.9107 1.7846 5.0144 6.8112 2.2393 6.6905 1.6665 1.0805 2.8296 2.8986 0.7192 4.4983 22.6840 0.3229 4.0222 0.9908 0.2074 20.6067 0.0301 9.8982 6.0766 20.1549 6.1325 2.9627 0.9728 0.1353 96.5825 1.4738 5.2977 4.9590 10.0841 242.8081 5.4819 3.8507 7.1446 4.6238 0.6792 182.1704 14.6597 1.4448 12.3190 6.1682 0.3605 0.1902 125.5657 184.9867 2.1997 6.7543 6.2330 2.0799 2.8747 1.0473 0.4102 3.1426 0.6372 0.4828 0.5308 0.2138 11.7971 1.8417 0.0415 10.7995 7.1942 15.3758 17.3361 2.4960 0.3824 4.0120 0.9570 3.3967 0.0414 22.4122 6.1549 1.8480 4.3540 38.4363 1.7062 315.8679 79.0461 5.2467 47.5193 15.2586 35.3962 7.8889 0.0890 28.7196 51.7741 40.2000 38.4890 19.8831 18.0015 18.8856 0.4560 3.5079 8.7044 0.0458 26.9841 8.0045 5.0774 274.3479 28.9422 61.1329 30.3021 16.5513 46.8382
temp: 298.150 k
press: 1.00000 atm
elementType: 8 8 8 8 6 6 6 6 6 6 6 6 6 6 6 6 6 6 1 1 1 1 1 1 1 1 1 1 1 1 1 1 1 1 1 1 1 1 1 1 1 1 1 1
symmnumber: 1
zpe: 999919.7 jmol-1
zpe.correction: 0.380849 hartree
zpe.thermalcorrener: 0.403497 hartree
zpe.thermalcorrenthalpy: 0.404441 hartree
zpe.thermalcorrgfe: 0.324447 hartree
zpe.sumelectzpe: -848.531748 hartree
zpe.sumelectthermal: -848.509100 hartree
zpe.sumelectthermalent: -848.508156 hartree
zpe.sumelectthermalfe: -848.588150 hartree
dipole: 2.0820 0.0420 -0.0136
dipole: 2.0825
quadrupole: -99.3690 -118.8007 -119.4522
quadrupole: 0.9650 -0.5389 13.7785
quadrupole: 13.1717 -6.2601 -6.9116 0.9650 -0.5389 13.7785
hfenergy: -848.9125969 hartree
pointgroup: C01 [X(C14H26O4)]
dipole: 0.8176944 -0.0507159 -0.0076175 debye
polarizability: 196.576383|-1.9987488|155.9698346|-0.3712778|-7.2200796|139.8880426 unknown
InChI: InChI=1S/C14H26O4/c1-3-5-11-17-13(15)9-7-8-10-14(16)18-12-6-4-2/h3-12H2,1-2H3
charge 0 multiplicity 1
44 atoms
O  -0.66103 -2.055059 -0.373508
O  -0.541075 2.148803 0.386766
O  -1.807477 -2.877755 1.479742
O  -1.616195 3.089078 -1.453193
C  -3.01349 -0.283069 -0.648545
C  -3.00387 0.553047 0.650121
C  -3.052986 -1.811781 -0.381184
C  -2.944944 2.080703 0.381702
C  1.748853 -2.062287 -0.691636
C  1.8593 1.92172 0.688727
C  0.625356 -2.468225 0.262083
C  0.77572 2.472331 -0.238378
C  -1.823857 -2.312223 0.361665
C  -1.678571 2.504294 -0.346686
C  3.141509 -2.441394 -0.134384
C  3.279001 2.166142 0.124508
C  4.288703 -2.013791 -1.074623
C  4.383457 1.604486 1.04531
H  -3.896243 -0.009823 -1.259493
H  -2.117717 -0.053121 -1.254662
H  -3.915773 0.333872 1.239624
H  -2.138395 0.270526 1.277486
H  -3.935607 -2.082511 0.223498
H  -3.116789 -2.345941 -1.347928
H  -3.801449 2.406386 -0.233395
H  -2.987359 2.619341 1.347302
H  1.590627 -2.55153 -1.671986
H  1.70014 -0.969848 -0.867952
H  1.764364 2.393935 1.685402
H  1.694626 0.835811 0.832102
H  0.706734 -1.96748 1.24529
H  0.59752 -3.560187 0.436358
H  0.809621 2.011807 -1.243708
H  0.846288 3.569274 -0.362146
H  3.283487 -1.970288 0.860228
H  3.187069 -3.536751 0.031517
H  3.362785 1.702005 -0.879884
H  3.436786 3.253908 -0.021539
H  4.292466 -0.917084 -1.222071
H  5.273564 -2.30263 -0.664862
H  4.183698 -2.486054 -2.06923
H  4.273594 0.510995 1.174872
H  5.389558 1.795862 0.630024
H  4.337203 2.067808 2.048567
