program: Gaussian 09
title: 000007740
version: EM64L-G09RevD.01
frameworkgroup: C1[X(C12H24N2)]
method: RPBEPBE
basis: SDD
operation: Freq
keyword: #pfreq=noraman
keyword: PBEPBE/SDD
title: #p freq=noraman PBEPBE/SDD
converged: YES YES NO NO
title: Mulliken charges:
elementType: N N C C C C C C C C C C C C H H H H H H H H H H H H H H H H H H H H H H H H
charge: -0.099415 -0.099411 -0.311307 -0.303122 -0.311307 -0.303111 -0.404207 -0.404207 -0.687657 -0.692549 -0.687663 -0.692563 -0.037052 -0.037064 0.175879 0.236283 0.173264 0.210308 0.175874 0.236286 0.173261 0.210306 0.231226 0.209076 0.209074 0.231233 0.229395 0.205228 0.210155 0.233143 0.209485 0.211874 0.229397 0.205227 0.210155 0.233143 0.209489 0.211877
chargesum: 0.00000
title: Mulliken charges with hydrogens summed into heavy atoms:
elementType: N N C C C C C C C C C C C C
charge: -0.099415 -0.099411 0.100854 0.080450 0.100854 0.080456 0.036095 0.036099 -0.042879 -0.038048 -0.042884 -0.038055 -0.037052 -0.037064
polarizability: 1.91206909e+02 4.49718155e-04 1.38153468e+02 2.71075593e-01 4.93977008e-05 1.14510305e+02
1716.lowfreq: -4.5965 -3.3845 -0.0008 -0.0006 -0.0001 7.5571 12.7030 27.3227 28.9351
frequency: 5.4871 27.3118 28.5634 52.0765 56.6909 71.1476 77.1467 93.1055 131.4840 181.6807 183.6513 210.8856 210.9222 221.4261 231.1460 269.9697 277.0371 284.2615 314.4246 337.9572 361.0627 367.7189 409.8861 443.8563 467.6134 491.1129 570.9214 734.3787 735.1438 789.8512 796.5270 803.7196 804.4291 816.1523 908.7656 910.0217 970.4002 976.9549 989.0534 992.9607 1053.1129 1063.5172 1074.9784 1075.1820 1086.5559 1087.9715 1114.3442 1116.6122 1156.2794 1160.8208 1169.9212 1193.1470 1193.8141 1240.0520 1244.2859 1276.3974 1277.6182 1286.2568 1288.1021 1352.5577 1355.2548 1361.5539 1362.4404 1376.0753 1376.3021 1386.9192 1387.4588 1387.7792 1388.8423 1457.7555 1458.3177 1464.9401 1466.2431 1468.6507 1469.8592 1471.6490 1474.7291 1476.3065 1478.6042 1486.5173 1486.9170 1492.2651 1492.3613 2286.5840 2814.9757 2815.7606 2831.0762 2831.2602 2850.2669 2850.3709 2983.8792 2984.2751 2984.6390 2984.7026 3024.2825 3024.3380 3033.1182 3033.1990 3040.9546 3041.0268 3074.6584 3075.1855 3077.2335 3077.5433 3090.5928 3090.8629 3093.3272 3093.3301
redmass: 3.1612 3.5078 3.2985 2.1356 2.0682 2.4487 1.9361 1.7686 2.0952 2.0592 1.3916 1.5068 1.6304 1.7381 1.5289 2.2263 2.0669 1.9707 2.6094 3.7656 3.2186 3.1048 3.2402 2.9206 2.6155 2.9788 5.1662 3.1260 3.0783 1.4189 1.1419 1.1683 1.1863 2.1030 1.8790 1.8935 2.3820 2.0702 1.9196 1.7051 2.7437 2.7515 1.9154 1.9301 2.0914 2.0570 1.8941 1.8904 2.6743 1.8462 2.1291 2.3054 2.3858 1.3019 1.2460 1.1693 1.1471 1.1833 1.1816 1.4932 1.3357 1.3230 1.3218 1.3810 1.3545 1.2293 1.2252 1.2289 1.2381 1.0773 1.0793 1.0542 1.0572 1.0524 1.0492 1.0538 1.0519 1.0635 1.0577 1.0571 1.0621 1.0728 1.0708 11.7550 1.0718 1.0719 1.0720 1.0721 1.0707 1.0707 1.0357 1.0357 1.0361 1.0360 1.0833 1.0833 1.0878 1.0879 1.0871 1.0871 1.0985 1.0983 1.0973 1.0973 1.1003 1.1002 1.1002 1.1002
irintensity: 0.0197 0.3404 0.6107 0.1191 0.8146 0.3309 0.6391 2.0801 1.2316 0.0279 0.0728 3.2089 1.3278 0.0065 6.5708 3.8361 0.0855 3.1346 1.0775 0.4029 5.8151 1.1791 2.8349 0.1065 9.4740 0.4631 0.4040 21.9152 3.2978 4.3528 4.5213 9.6083 1.0991 4.8854 2.5930 0.0287 7.3981 12.6437 4.5166 5.2402 19.3612 30.3138 37.7045 0.0078 1.3926 6.8087 1.7199 43.9826 9.1295 18.6884 13.6166 11.6394 51.2383 18.0647 12.3028 35.2138 0.8389 18.6748 16.3809 44.7447 0.0570 11.7188 1.7477 4.8421 0.7582 22.6095 3.6406 26.2247 37.7281 1.5111 7.3273 12.6663 1.0787 6.9939 13.0177 0.0974 5.1794 0.9551 8.0121 20.7926 0.3360 0.5779 26.6148 0.0041 80.1994 27.5693 130.1988 30.2932 388.8476 3.2542 2.8121 66.6288 41.8417 6.6812 16.1342 16.8155 9.0281 0.3145 0.6868 16.8208 8.1602 47.8500 174.4155 8.9494 78.1232 3.9225 33.0437 38.1072
temp: 298.150 k
press: 1.00000 atm
elementType: 7 7 6 6 6 6 6 6 6 6 6 6 6 6 1 1 1 1 1 1 1 1 1 1 1 1 1 1 1 1 1 1 1 1 1 1 1 1
symmnumber: 1
zpe: 886633.9 jmol-1
zpe.correction: 0.337701 hartree
zpe.thermalcorrener: 0.356617 hartree
zpe.thermalcorrenthalpy: 0.357561 hartree
zpe.thermalcorrgfe: 0.286871 hartree
zpe.sumelectzpe: -579.918785 hartree
zpe.sumelectthermal: -579.899869 hartree
zpe.sumelectthermalent: -579.898925 hartree
zpe.sumelectthermalfe: -579.969615 hartree
dipole: 0.0002 -0.1863 0.0002
dipole: 0.1863
quadrupole: -77.2928 -87.1621 -90.7238
quadrupole: 0.0001 -4.1984 -0.0003
quadrupole: 7.7667 -2.1025 -5.6643 0.0001 -4.1984 -0.0003
hfenergy: -580.2564856 hartree
pointgroup: C01 [X(C12H24N2)]
dipole: 0.0000605 0.0733014 -0.000076 debye
polarizability: 191.198896|0.0000364|138.1534683|-0.8294429|-0.0012968|114.5183184 unknown
InChI: InChI=1S/C12H24N2/c1-5-13(6-2)11-9-10-12-14(7-3)8-4/h5-8,11-12H2,1-4H3
charge 0 multiplicity 1
38 atoms
N  2.702369 0.000769 0.080933
N  -2.702351 0.000702 -0.080986
C  2.164858 -1.043973 0.999544
C  4.186358 0.104274 0.136596
C  -2.164677 -1.044104 -0.999423
C  -4.186339 0.104119 -0.136882
C  2.06595 1.32938 0.327991
C  -2.065938 1.32931 -0.328088
C  2.430262 -2.476644 0.501726
C  4.795397 0.85543 -1.063265
C  -2.430191 -2.476731 -0.50154
C  -4.795625 0.855414 1.06277
C  0.609625 1.328516 0.093561
C  -0.609639 1.328499 -0.093501
H  2.568426 -0.918736 2.038143
H  1.072486 -0.888828 1.06138
H  4.525477 0.581533 1.09436
H  4.586714 -0.924723 0.139112
H  -2.568074 -0.918944 -2.038098
H  -1.072293 -0.888968 -1.061086
H  -4.525352 0.581196 -1.094776
H  -4.586621 -0.924907 -0.139288
H  2.532123 2.064676 -0.353519
H  2.265875 1.689797 1.372583
H  -2.26577 1.689643 -1.372729
H  -2.532188 2.064648 0.353319
H  2.024919 -2.601577 -0.517607
H  3.506717 -2.725178 0.475744
H  1.938073 -3.207518 1.169966
H  4.439998 0.407673 -2.007593
H  4.533381 1.928787 -1.07113
H  5.898735 0.788178 -1.033773
H  -2.025035 -2.60159 0.517876
H  -3.506656 -2.725245 -0.475735
H  -1.937891 -3.207663 -1.169635
H  -4.440275 0.407883 2.007224
H  -4.533777 1.928812 1.070466
H  -5.89895 0.787991 1.033162
