program: Gaussian 09
title: 000067401
version: EM64L-G09RevD.01
frameworkgroup: C1[X(C24H28O5)]
method: RPBEPBE
basis: SDD
operation: Freq
keyword: #pfreq=noraman
keyword: PBEPBE/SDD
title: #p freq=noraman PBEPBE/SDD
converged: YES YES NO NO
title: Mulliken charges:
elementType: O O O O O C C C C C C C C C C C C C C C C C C C C C C C C H H H H H H H H H H H H H H H H H H H H H H H H H H H H
charge: -0.288780 -0.231227 -0.437596 -0.413881 -0.238264 0.296013 -0.164858 -0.117341 0.163604 -0.157302 -0.521884 -0.553572 -0.498089 -0.488443 -0.510557 -0.819799 0.248869 -0.589276 0.320645 0.266237 -0.348023 -0.585377 0.254550 -0.411637 0.292418 -0.537901 -0.525096 -0.477889 0.193056 0.246415 0.238908 0.208366 0.223664 0.221134 0.219984 0.228491 0.231577 0.259601 0.224332 0.196668 0.221925 0.218682 0.225961 0.228159 0.246046 0.222018 0.224838 0.223091 0.222968 0.249049 0.288001 0.255047 0.279572 0.287927 0.259253 0.351164 0.378556
chargesum: 0.00000
title: Mulliken charges with hydrogens summed into heavy atoms:
elementType: O O O O O C C C C C C C C C C C C C C C C C C C C C C C C
charge: -0.288780 -0.231227 -0.086431 -0.035324 -0.238264 0.296013 0.081557 0.121567 0.163604 0.051064 -0.077086 -0.105096 -0.006911 -0.067443 -0.069949 -0.119633 0.248869 -0.142420 0.320645 0.266237 -0.124932 -0.362409 0.254550 -0.162588 0.292418 -0.249900 0.009524 0.069291 0.193056
polarizability: 3.58053176e+02 9.65334355e+00 2.39022768e+02 1.03770893e+01 -1.41807982e+01 2.05086151e+02
1716.lowfreq: -15.0351 -6.9277 -2.2858 0.0000 0.0007 0.0011 14.8934 22.1160 22.5840
frequency: 14.1217 22.0866 22.5632 34.9203 48.7000 68.3031 72.7099 79.2923 92.4746 97.0556 117.0362 126.9337 140.0948 146.5497 172.2258 183.0170 204.5990 213.1106 232.5804 236.8966 251.1991 274.7414 279.5333 291.9269 293.6872 338.5207 347.7237 356.8380 365.2900 396.2619 410.2632 433.1271 436.1823 446.3327 447.7318 455.5937 472.1548 487.2579 508.5638 512.5632 529.8366 545.9393 559.4609 578.3269 588.0680 617.7192 622.4834 625.9796 638.2526 647.7792 668.0041 688.0124 704.4670 710.2451 725.4477 778.3440 781.2123 793.2126 817.8345 826.1744 829.5493 842.6162 853.6154 863.8487 882.9085 903.4804 908.2518 921.5806 931.0888 947.2498 951.1860 974.3785 978.0693 999.3581 1011.0814 1017.6037 1026.5325 1042.1748 1046.8501 1049.3725 1063.7727 1084.6451 1093.5359 1101.5916 1110.9551 1117.4933 1124.2945 1133.6277 1138.3709 1150.6996 1165.1756 1168.3214 1174.7995 1184.7313 1186.9111 1208.0422 1221.0491 1228.9039 1232.9941 1239.5145 1251.4470 1257.0233 1257.6778 1260.3045 1273.4609 1285.3797 1291.1658 1296.4712 1305.7785 1318.8118 1322.4638 1329.2582 1332.3720 1337.0802 1346.1143 1355.2788 1375.7490 1380.3119 1383.0907 1388.6447 1426.8302 1441.8339 1451.3883 1456.4917 1457.1603 1465.8390 1469.9774 1472.1535 1478.3634 1489.0381 1490.7515 1500.2797 1601.7979 1619.3410 1639.7418 1665.5863 2132.1617 2901.3332 2932.2795 2954.9974 2959.1455 2972.7734 2978.8859 2988.5053 2995.2657 2999.5022 3001.2809 3006.0049 3015.9012 3030.7855 3034.9300 3035.7823 3048.2268 3059.7105 3061.9419 3081.8376 3090.1950 3090.3101 3099.4736 3112.9305 3141.4325 3170.7021 3427.0800 3515.5168 3581.3949
redmass: 5.6507 6.5448 8.3112 5.3298 3.9101 5.7041 2.9081 4.4674 3.6793 3.4358 4.3223 2.3232 6.8734 2.5899 3.9885 2.2245 2.4463 2.4766 2.5187 3.5637 5.2310 2.5894 4.1585 4.3276 3.9519 2.8972 1.1413 2.6650 3.3121 4.0859 4.1120 3.3239 3.7517 3.6754 3.3481 3.8724 4.2186 2.8839 2.0444 2.9266 4.8463 3.6273 2.8266 4.1732 4.0399 3.8473 1.4610 2.8986 3.1676 1.5627 1.2647 2.8712 4.2852 4.2242 4.3113 1.6610 2.7472 1.7439 2.1051 1.4636 2.2542 1.7672 2.9433 2.3451 2.3812 2.6745 3.6040 2.9593 2.1460 2.1768 1.3931 2.4524 2.2937 2.2444 2.2235 2.1582 2.5028 1.9982 2.8881 3.1318 2.4003 2.3985 2.5308 2.0365 2.4321 2.2984 1.8669 1.8568 1.9627 1.6872 1.3419 1.8629 1.4355 1.6851 1.4477 1.8949 1.5546 1.4047 1.5172 1.3294 1.4903 1.5143 1.3538 2.1125 1.4516 1.4021 1.6235 1.4474 1.4351 1.3709 1.7665 1.4856 1.3578 1.5337 1.4468 1.5321 1.5484 2.0060 4.5993 1.1979 3.3574 1.0738 1.0940 1.1241 1.0689 1.0807 1.0922 1.0809 1.0760 1.0648 1.0743 2.7381 6.6405 6.6274 10.3643 8.1551 6.0474 1.0802 1.0802 1.0644 1.0793 1.0665 1.0593 1.0618 1.0622 1.0646 1.0376 1.0640 1.0939 1.0664 1.0991 1.1013 1.1023 1.1007 1.0941 1.0973 1.0938 1.0953 1.0989 1.1002 1.0873 1.0959 1.1591 1.0639 1.0659
irintensity: 0.1787 0.1294 0.7192 0.2644 0.7176 0.9902 0.2573 2.1335 0.6181 0.3956 1.8740 0.3864 3.6029 0.4306 1.6030 1.3708 1.5498 0.6102 2.5811 3.9399 2.8254 0.3273 6.8670 0.4291 0.9705 1.8901 139.4725 1.2047 0.4870 4.6179 3.0698 7.0304 6.4924 2.1604 5.4398 43.3762 5.8657 0.4656 53.9279 0.9201 2.7727 30.2042 7.8802 11.1354 18.0614 16.1930 41.0279 6.5819 24.5064 108.0584 51.9511 2.9894 1.9502 3.4686 4.5305 6.4248 8.5446 17.0903 3.6625 5.3920 7.9033 21.8830 12.9835 42.9070 5.6189 16.8206 51.7699 27.2267 20.3761 133.3760 10.8511 9.5238 16.6058 38.1050 40.9598 28.3760 7.6009 6.3457 37.4855 74.1551 17.3965 6.4142 172.9518 4.9434 7.2042 184.8836 42.8410 42.5259 268.5204 4.0219 46.8806 1.9928 18.7635 6.3714 13.8985 1.5828 2.1026 11.0481 4.7940 55.9876 8.4828 4.8452 7.5188 23.1130 4.8116 3.1466 5.1887 5.3982 2.4712 1.8112 187.9719 2.6110 0.7493 5.0948 1.4800 8.1981 3.7801 12.8427 5.5582 24.2872 41.2376 4.6171 62.0692 10.0889 1.9311 7.2740 7.3555 14.3142 6.3651 4.4484 10.1116 85.0623 10.2883 68.1334 184.9830 178.3458 0.2612 13.2615 6.4673 27.4806 13.2833 41.2614 24.9002 29.2953 29.4228 4.1276 27.8708 27.9395 39.7717 18.4900 22.2778 51.9009 51.9259 26.7409 3.4196 7.6927 39.1283 22.3561 22.4719 12.9023 11.6559 11.0780 65.3015 26.3258 37.6770
temp: 298.150 k
press: 1.00000 atm
elementType: 8 8 8 8 8 6 6 6 6 6 6 6 6 6 6 6 6 6 6 6 6 6 6 6 6 6 6 6 6 1 1 1 1 1 1 1 1 1 1 1 1 1 1 1 1 1 1 1 1 1 1 1 1 1 1 1 1
symmnumber: 1
zpe: 1223675.3 jmol-1
zpe.correction: 0.466073 hartree
zpe.thermalcorrener: 0.493935 hartree
zpe.thermalcorrenthalpy: 0.494879 hartree
zpe.thermalcorrgfe: 0.406095 hartree
zpe.sumelectzpe: -1305.280994 hartree
zpe.sumelectthermal: -1305.253132 hartree
zpe.sumelectthermalent: -1305.252188 hartree
zpe.sumelectthermalfe: -1305.340972 hartree
dipole: -0.8172 2.0408 -1.8446
dipole: 2.8697
quadrupole: -167.0039 -177.5183 -164.4097
quadrupole: -17.7969 -0.8298 -1.5615
quadrupole: 2.6400 -7.8743 5.2343 -17.7969 -0.8298 -1.5615
hfenergy: -1305.7470672 hartree
pointgroup: C01 [X(C24H28O5)]
dipole: 0.3047572 -0.7073817 -0.8255026 debye
polarizability: 358.1656963|9.3736739|234.5754869|-10.0861283|18.0774319|209.4209119 unknown
InChI: InChI=1S/C24H28O5/c1-3-24(29-22(28)9-8-21(26)27)13-11-20-19-6-4-15-14-16(25)5-7-17(15)18(19)10-12-23(20,24)2/h1,5,7,14,18-20,25-26H,4,6,8-13H2,2H3
charge 0 multiplicity 1
57 atoms
O  -2.85574 0.180034 -0.006152
O  -4.478566 -1.457377 0.415959
O  8.165904 1.427787 -0.325213
O  -8.793845 1.049541 -0.949315
O  -7.525434 2.41585 0.433022
C  -0.370962 -0.028926 -0.067322
C  0.58297 -1.267557 -0.066908
C  2.017718 -0.904054 -0.487761
C  -1.713752 -0.752599 0.339312
C  2.572915 0.154251 0.516427
C  0.172286 1.03023 0.918415
C  -0.199068 -2.347276 -0.860844
C  -1.70531 -2.05992 -0.539624
C  1.645469 1.401789 0.593758
C  2.970464 -2.117857 -0.532805
C  -0.548789 0.598492 -1.476621
C  4.047851 0.486163 0.237354
C  4.335945 -1.696551 -1.11293
C  4.879458 -0.408572 -0.497869
C  -1.793767 -1.058797 1.778968
C  4.641966 1.667297 0.759608
C  6.249598 -0.101158 -0.689783
C  -4.167598 -0.281542 0.123698
C  6.001402 1.976764 0.57038
C  6.809732 1.081611 -0.162937
C  -1.854546 -1.322999 2.980353
C  -5.141401 0.861202 -0.12014
C  -6.538612 0.344906 -0.502691
C  -7.613079 1.386525 -0.272831
H  0.642425 -1.617838 0.988292
H  2.001718 -0.458258 -1.506071
H  2.528883 -0.33039 1.520622
H  0.12348 0.627884 1.949309
H  -0.457152 1.940843 0.896167
H  0.091014 -3.368715 -0.560316
H  -0.000843 -2.255891 -1.945696
H  -2.28655 -1.872144 -1.459663
H  -2.195369 -2.889268 -0.009327
H  1.71078 1.964455 -0.35799
H  1.999893 2.089506 1.38393
H  2.54028 -2.928135 -1.15176
H  3.09697 -2.522148 0.492634
H  0.397457 1.034224 -1.83693
H  -0.885844 -0.135187 -2.229007
H  -1.30023 1.404124 -1.434628
H  4.227158 -1.548472 -2.208245
H  5.07675 -2.509786 -0.98611
H  4.032461 2.370548 1.336216
H  6.879602 -0.802421 -1.256461
H  6.44591 2.888982 0.978637
H  -1.926089 -1.565265 4.024635
H  -4.727385 1.542616 -0.882647
H  -5.210397 1.456883 0.811371
H  -6.783032 -0.545041 0.110867
H  -6.584225 0.005076 -1.551815
H  8.641999 0.737591 -0.850262
H  -9.491975 1.730668 -0.747961
