program: Orca
programVersion: 5.0.2
elementType: Cl Cl F F F F O O C C C C C C C C C C C C C C C H H H H H H H H H H H H
charge: 0
multiplicity: 1
keywords: wb97x-d3
keywords: def2-TZVPP
keywords: def2/J RIJCOSX
keywords: DEFGRID2
keywords: scfconv7
keywords: smallprint printgap noloewdin
keywords: NOSOSCF
formula: C15H12Cl2F4O2
InChI: InChI=1/C15H12Cl2F4O2/c1-15(2)7(3-10(16)17)11(15)14(22)23-5-6-12(20)8(18)4-9(19)13(6)21/h3-4,7,11H,5H2,1-2H3
35 atoms
Cl -5.519715 0.532573 1.179548
Cl -6.155368 1.163858 -1.56213
F  3.06804 2.012119 -1.46321
F  3.065943 -0.784063 2.315922
F  5.252274 -2.021967 1.392035
F  5.242239 0.756776 -2.392374
O  0.672641 0.887628 0.108007
O  -0.419449 -0.000663 1.854521
C  -1.892462 -1.590341 -0.422753
C  -1.304154 -0.195713 -0.365251
C  -2.754353 -0.439302 0.011195
C  -1.546296 -2.627697 0.616698
C  -2.047663 -2.175889 -1.805807
C  -3.798206 0.115008 -0.85735
C  -0.335946 0.217155 0.669206
C  -4.987651 0.545532 -0.457248
C  1.762125 1.349904 0.9126
C  3.010644 0.657433 0.453127
C  3.597887 1.018346 -0.749703
C  3.591602 -0.384224 1.158274
C  4.722144 -1.025144 0.683002
C  4.721783 0.374644 -1.226645
C  5.298019 -0.655283 -0.512943
H  -1.140174 0.262644 -1.333663
H  -2.960345 -0.409499 1.075083
H  -1.550092 -2.240313 1.631945
H  -2.278491 -3.435097 0.573465
H  -0.565159 -3.062874 0.42045
H  -2.211943 -1.422743 -2.574884
H  -1.145719 -2.72602 -2.078175
H  -2.884106 -2.876042 -1.834145
H  -3.588603 0.184147 -1.918021
H  1.579944 1.186122 1.971508
H  1.837508 2.424577 0.755409
H  6.181059 -1.161793 -0.880798
elementType: Cl F O C H
totalener: -2049.15528990 hartree
nucrepener: 2181.90339117 hartree
electener: -4231.05868107 hartree
oneelecener: -7160.00105520 hartree
twoeener: 2928.94237413 hartree
cpcmener: -0.02526320 hartree
kineticenergy: 2043.54264423 hartree
xcener: -143.165541884382 hartree
chargesum: -0.0000000
charge: -0.057769 -0.062421 -0.203366 -0.204223 -0.204093 -0.203755 -0.276137 -0.485311 0.091028 -0.099610 0.029602 -0.271282 -0.267023 -0.197257 0.436681 0.037555 0.078712 -0.178597 0.236760 0.286934 0.188981 0.186091 -0.153207 0.097785 0.078519 0.092755 0.098673 0.101507 0.093169 0.098974 0.100854 0.131994 0.110107 0.130517 0.156855
qa: -0.0578 -0.0624 -0.2034 -0.2042 -0.2041 -0.2038 -0.2761 -0.4853 0.0910 -0.0996 0.0296 -0.2713 -0.2670 -0.1973 0.4367 0.0376 0.0787 -0.1786 0.2368 0.2869 0.1890 0.1861 -0.1532 0.0978 0.0785 0.0928 0.0987 0.1015 0.0932 0.0990 0.1009 0.1320 0.1101 0.1305 0.1569
va: 1.2679 1.2426 1.0983 1.0944 1.0836 1.0847 2.1354 2.0252 3.7226 3.8471 3.8737 3.9032 3.9101 3.8953 4.1566 4.2078 3.8037 3.6762 3.9259 3.8532 3.9572 3.9623 3.8528 1.0330 1.0464 1.0193 1.0000 0.9989 1.0051 1.0011 1.0008 1.0181 1.0342 0.9976 0.9970
dispcorr: -0.016141383 hartree
energy: -2049.171431283558
dipole: -7.83737 9.04279 1.20542 -14.71725 14.33807 -0.37918 -3.09583 1.82680 -1.26903
magnitude: 1.79088 au
magnitude: 4.55207 debye
