program: Orca
programVersion: 5.0.2
elementType: Cl Cl F F F F O O C C C C C C C C C C C C C C C H H H H H H H H H H H H
charge: 0
multiplicity: 1
keywords: wb97x-d3
keywords: def2-TZVPP
keywords: def2/J RIJCOSX
keywords: DEFGRID2
keywords: scfconv7
keywords: smallprint printgap noloewdin
keywords: NOSOSCF
formula: C15H12Cl2F4O2
InChI: InChI=1/C15H12Cl2F4O2/c1-15(2)7(3-10(16)17)11(15)14(22)23-5-6-12(20)8(18)4-9(19)13(6)21/h3-4,7,11H,5H2,1-2H3
35 atoms
Cl -1.279744 1.723716 0.60991
Cl -3.650994 2.995266 -0.441854
F  1.294677 0.385849 1.787919
F  3.631735 -1.716761 -1.710017
F  4.853605 0.589461 -2.270243
F  2.489727 2.701863 1.197185
O  0.3637 -1.864174 -0.080496
O  -0.546435 -2.166252 1.949906
C  -3.253456 -2.152304 0.329475
C  -1.903402 -1.495781 0.092132
C  -2.988125 -0.799215 0.889193
C  -3.394946 -3.315684 1.277535
C  -4.120469 -2.270705 -0.899714
C  -3.604755 0.425478 0.333704
C  -0.660557 -1.882674 0.781017
C  -2.937432 1.560522 0.183027
C  1.704486 -2.00287 0.397759
C  2.436562 -0.735086 0.068511
C  2.173616 0.422688 0.784962
C  3.345358 -0.644008 -0.972078
C  3.974416 0.552122 -1.269163
C  2.789078 1.618944 0.480123
C  3.701807 1.69602 -0.551414
H  -1.752657 -1.130346 -0.916769
H  -2.807874 -0.766613 1.960854
H  -2.85027 -3.178085 2.208374
H  -4.447488 -3.449542 1.53263
H  -3.048894 -4.240423 0.813236
H  -5.1762 -2.282681 -0.62326
H  -3.967101 -1.450452 -1.601288
H  -3.905784 -3.20075 -1.428097
H  -4.651543 0.405365 0.053264
H  2.147971 -2.861269 -0.101525
H  1.731172 -2.19746 1.468871
H  4.189641 2.631097 -0.794709
elementType: Cl F O C H
totalener: -2049.15254235 hartree
nucrepener: 2327.60785513 hartree
electener: -4376.76039748 hartree
oneelecener: -7452.13710129 hartree
twoeener: 3075.37670382 hartree
cpcmener: -0.02392682 hartree
kineticenergy: 2043.56047130 hartree
xcener: -143.167693104089 hartree
chargesum: -0.0000000
charge: -0.058876 -0.058122 -0.202417 -0.203115 -0.203880 -0.203651 -0.280075 -0.481939 0.142058 -0.141438 -0.033923 -0.275226 -0.278277 -0.225160 0.414537 0.088361 0.073481 -0.124505 0.218411 0.228497 0.196019 0.211892 -0.159240 0.113890 0.112352 0.091810 0.096814 0.101496 0.101858 0.094015 0.099408 0.142624 0.116472 0.129610 0.156240
qa: -0.0589 -0.0581 -0.2024 -0.2031 -0.2039 -0.2037 -0.2801 -0.4819 0.1421 -0.1414 -0.0339 -0.2752 -0.2783 -0.2252 0.4145 0.0884 0.0735 -0.1245 0.2184 0.2285 0.1960 0.2119 -0.1592 0.1139 0.1124 0.0918 0.0968 0.1015 0.1019 0.0940 0.0994 0.1426 0.1165 0.1296 0.1562
va: 1.2928 1.2483 1.0968 1.0991 1.0840 1.0851 2.1142 2.0205 3.7060 3.8322 3.8774 3.8906 3.9143 3.9198 4.1446 4.1755 3.8035 3.6312 3.8458 3.9375 3.9497 3.9686 3.8625 1.0265 1.0236 1.0188 1.0011 0.9986 0.9994 0.9991 1.0026 1.0074 1.0085 1.0213 0.9971
dispcorr: -0.018614174 hartree
energy: -2049.171156521794
dipole: -27.74519 27.25471 -0.49047 -28.71741 28.10163 -0.61579 2.57366 -3.44860 -0.87494
magnitude: 1.17698 au
magnitude: 2.99164 debye
