program: Orca
programVersion: 5.0.2
elementType: Cl Cl F F F F O O C C C C C C C C C C C C C C C H H H H H H H H H H H H
charge: 0
multiplicity: 1
keywords: wb97x-d3
keywords: def2-TZVPP
keywords: def2/J RIJCOSX
keywords: DEFGRID2
keywords: scfconv7
keywords: smallprint printgap noloewdin
keywords: NOSOSCF
formula: C15H12Cl2F4O2
InChI: InChI=1/C15H12Cl2F4O2/c1-15(2)7(3-10(16)17)11(15)14(22)23-5-6-12(20)8(18)4-9(19)13(6)21/h3-4,7,11H,5H2,1-2H3
35 atoms
Cl -3.903599 1.010957 1.944116
Cl -6.23075 0.387969 0.354341
F  2.529503 -1.181946 -1.755191
F  2.717961 2.507077 1.155607
F  4.619398 1.289965 2.571501
F  4.437184 -2.401793 -0.326156
O  0.291321 0.706805 -0.998825
O  0.059771 0.218195 -3.172537
C  -1.593353 -1.715019 -0.621592
C  -1.543898 -0.612005 -1.659993
C  -2.293355 -0.409948 -0.358518
C  -0.391132 -2.049235 0.228397
C  -2.396807 -2.936421 -0.999237
C  -3.756839 -0.292792 -0.41255
C  -0.323654 0.134946 -2.031482
C  -4.516881 0.289737 0.50585
C  1.536355 1.378402 -1.194885
C  2.586165 0.706788 -0.359731
C  3.044294 -0.558972 -0.69435
C  3.132231 1.302012 0.765015
C  4.114995 0.669233 1.505849
C  4.02112 -1.192467 0.046464
C  4.570036 -0.582768 1.155814
H  -2.163221 -0.80092 -2.529992
H  -1.802694 0.221266 0.372677
H  0.114056 -1.174129 0.629897
H  -0.710166 -2.654406 1.079131
H  0.334524 -2.638044 -0.335531
H  -1.755013 -3.670432 -1.489934
H  -2.81779 -3.408311 -0.109448
H  -3.217739 -2.716904 -1.680728
H  -4.26767 -0.711811 -1.271693
H  1.396718 2.414327 -0.893535
H  1.826962 1.380525 -2.245032
H  5.337755 -1.077447 1.737054
elementType: Cl F O C H
totalener: -2049.16572904 hartree
nucrepener: 2247.41751016 hartree
electener: -4296.58323920 hartree
oneelecener: -7290.61161816 hartree
twoeener: 2994.02837895 hartree
cpcmener: -0.02164023 hartree
kineticenergy: 2043.54027481 hartree
xcener: -143.164964202471 hartree
chargesum: -0.0000000
charge: -0.056747 -0.060221 -0.201387 -0.201528 -0.201457 -0.201041 -0.270875 -0.452774 0.093584 -0.112714 0.059226 -0.279123 -0.261729 -0.219221 0.413491 0.040859 0.042372 -0.139205 0.239909 0.237862 0.193987 0.205578 -0.165643 0.095241 0.085929 0.089635 0.102033 0.100646 0.099539 0.099028 0.089458 0.130755 0.114801 0.135368 0.154363
qa: -0.0567 -0.0602 -0.2014 -0.2015 -0.2015 -0.2010 -0.2709 -0.4528 0.0936 -0.1127 0.0592 -0.2791 -0.2617 -0.2192 0.4135 0.0409 0.0424 -0.1392 0.2399 0.2379 0.1940 0.2056 -0.1656 0.0952 0.0859 0.0896 0.1020 0.1006 0.0995 0.0990 0.0895 0.1308 0.1148 0.1354 0.1544
va: 1.2689 1.2451 1.0969 1.1005 1.0873 1.0896 2.1145 2.0555 3.7128 3.8575 3.8186 3.9091 3.9077 3.8828 4.1983 4.2116 3.8363 3.6109 3.8258 3.9185 3.9582 3.9875 3.8641 1.0317 1.0418 1.0121 1.0023 1.0023 1.0010 1.0017 1.0057 1.0176 1.0114 1.0198 0.9981
dispcorr: -0.018087687 hartree
energy: -2049.183816727721
dipole: -6.68947 7.31962 0.63015 -15.75643 15.10762 -0.64881 -10.85601 11.41894 0.56293
magnitude: 1.06534 au
magnitude: 2.70787 debye
