program: Gaussian 09
title: 000067242
version: EM64L-G09RevD.01
frameworkgroup: C1[X(C17H13NO5S)]
method: RPBEPBE
basis: SDD
operation: Freq
keyword: #p
keyword: freq=noraman
keyword: PBEPBE/SDD
title: #p freq=noraman PBEPBE/SDD
converged: YES YES NO NO
title: Mulliken charges:
elementType: S O O O O O N C C C C C C C C C C C C C C C C C H H H H H H H H H H H H H
charge: 0.983506 -0.406810 -0.566744 -0.504325 -0.500624 -0.260209 -0.484946 0.480022 0.254233 -0.051400 -0.462241 -0.708164 0.541157 0.172054 -0.322905 -0.399078 -0.402660 0.142005 0.250103 -0.338204 -0.353728 -0.221274 -0.235812 -0.222935 0.290704 0.242119 0.193041 0.306345 0.320311 0.319498 0.364059 0.275156 0.216130 0.381955 0.237260 0.234727 0.237672
chargesum: 0.00000
title: Mulliken charges with hydrogens summed into heavy atoms:
elementType: S O O O O O N C C C C C C C C C C C C C C C C C
charge: 0.983506 -0.042751 -0.184788 -0.504325 -0.500624 -0.260209 -0.165448 0.480022 0.254233 -0.051400 -0.171536 -0.466045 0.541157 0.172054 -0.129864 -0.092733 -0.082349 0.142005 0.250103 -0.063048 -0.137598 0.015986 -0.001086 0.014737
polarizability: 4.47824184e+02 4.11838419e+00 2.46788556e+02 7.25942186e+00 -5.88817177e+00 1.12935410e+02
1716.lowfreq: -5.1761 0.0008 0.0014 0.0022 2.2725 5.3011 23.3233 26.1487 34.3347
frequency: 23.1213 26.1048 34.3337 45.1040 61.7879 80.4714 100.2059 106.3084 135.8227 155.0814 164.1562 181.0308 197.5702 215.6002 235.9402 252.8988 266.3397 291.1594 293.4721 322.6159 326.2659 340.8119 344.0044 400.8851 409.3562 420.3403 449.0794 474.0403 501.5186 507.9616 532.1190 535.3748 582.1326 589.6029 609.4414 613.7643 644.0820 659.8891 667.1729 688.7510 704.6744 720.2793 756.2881 767.7522 792.6960 824.4926 833.5224 850.6620 854.9096 855.9545 871.3899 873.9109 920.8900 934.8542 944.3581 969.1330 985.2045 989.7062 990.3640 1008.1589 1024.6264 1048.4314 1053.1128 1075.2089 1087.2903 1102.8899 1134.2100 1168.5574 1175.8765 1194.0497 1204.2660 1244.8390 1257.7532 1266.3043 1306.6695 1322.7401 1345.9656 1380.2279 1385.6298 1425.8039 1431.8558 1436.9972 1453.6849 1479.0394 1495.7323 1537.4904 1578.3396 1596.5458 1602.2231 1610.0955 1611.7139 1636.6142 3100.4985 3114.5144 3119.3792 3136.1429 3148.6382 3159.3051 3161.4352 3172.9364 3182.5572 3195.5117 3478.5912 3529.9997 3591.4844
redmass: 5.6837 6.0472 6.3344 7.0076 6.3549 5.5283 4.7855 5.6898 4.2609 5.8825 2.3038 3.3599 5.1228 3.7724 5.9964 1.6208 4.1275 5.7192 4.2437 5.0272 7.5470 7.7925 8.4125 2.8274 7.8709 5.3765 2.8508 5.0598 6.8505 6.0054 9.3458 5.1046 3.7158 5.4254 7.3586 6.4177 1.8530 3.4976 2.4821 3.7192 1.5340 5.3006 6.6431 2.3605 2.4356 8.2392 1.7191 3.0567 1.6293 1.5032 4.4945 1.7301 1.8285 1.5578 3.4220 14.4831 1.5032 4.3037 1.3325 1.3476 2.5669 3.3696 1.2036 2.1338 1.7477 2.5395 1.3523 1.4565 1.0584 1.1182 1.3769 3.2717 1.5114 1.7562 2.4785 1.4602 2.5485 4.1768 8.8599 3.3229 4.5237 2.7458 3.0803 2.2838 2.8932 3.2813 5.3743 7.5481 6.1618 5.9438 5.1979 6.3469 1.0897 1.0883 1.0917 1.0867 1.0917 1.0927 1.0956 1.1009 1.0930 1.0948 1.0661 1.0758 1.0657
irintensity: 1.5961 0.9852 0.6859 2.2635 3.4509 0.5997 5.2270 6.2939 4.1718 11.1524 29.8250 20.2402 6.2090 6.0929 10.5689 82.2998 17.5853 31.2485 26.0094 8.5698 29.5098 2.8727 1.0440 1.9194 70.1821 29.4853 38.1104 11.8308 9.6602 0.5799 113.3131 22.8260 0.2843 77.8041 41.4252 0.6070 12.4072 13.6638 14.4676 7.9312 120.5482 15.1514 2.9078 0.4391 25.9560 47.3409 76.5187 29.8967 14.1211 7.7722 3.2765 8.4893 63.7690 3.5291 10.1998 67.9164 3.3720 1.5209 3.7388 2.2239 19.6611 15.5902 83.6950 37.8542 56.4646 13.3509 256.6857 5.8256 2.1699 16.3121 2.6194 131.7626 58.6411 31.0015 136.2857 42.3317 117.2248 251.2564 1.6379 18.4818 25.4290 33.6610 57.6600 40.2465 532.4720 78.2461 70.7792 70.9051 67.7003 7.1856 73.9593 144.1185 22.5660 17.6616 10.8948 0.5564 17.5128 4.9743 13.2000 24.7297 17.9709 20.6226 45.4581 12.6978 34.6890
temp: 298.150 k
press: 1.00000 atm
elementType: 16 8 8 8 8 8 7 6 6 6 6 6 6 6 6 6 6 6 6 6 6 6 6 6 1 1 1 1 1 1 1 1 1 1 1 1 1
symmnumber: 1
zpe: 692043.9 jmol-1
zpe.correction: 0.263586 hartree
zpe.thermalcorrener: 0.285477 hartree
zpe.thermalcorrenthalpy: 0.286421 hartree
zpe.thermalcorrgfe: 0.210694 hartree
zpe.sumelectzpe: -1482.706041 hartree
zpe.sumelectthermal: -1482.684150 hartree
zpe.sumelectthermalent: -1482.683206 hartree
zpe.sumelectthermalfe: -1482.758932 hartree
dipole: -6.7833 -0.7347 1.4158
dipole: 6.9684
quadrupole: -151.4308 -137.3253 -154.0681
quadrupole: 19.4066 14.0667 -6.7211
quadrupole: -3.8227 10.2828 -6.4600 19.4066 14.0667 -6.7211
hfenergy: -1482.9696265 hartree
pointgroup: C01 [X(C17H13N1O5S1)]
dipole: 2.6810916 -0.1808599 -0.5433191 debye
polarizability: 447.7516799|2.9723034|246.451693|9.2838289|8.8619834|113.3447775 unknown
InChI: InChI=1S/C17H13NO5S/c19-16-10-14(24(21,22)23)9-12-8-13(6-7-15(12)16)18-17(20)11-4-2-1-3-5-11/h1-10,18-19,21H
charge 0 multiplicity 1
37 atoms
S  -5.336319 -1.715412 0.154266
O  -3.640199 3.170783 -0.130782
O  -5.564069 -1.873898 -1.68487
O  -4.784689 -3.122457 0.730648
O  -6.674391 -1.044297 0.768409
O  3.431489 1.98059 0.077074
N  2.167372 -0.00092 0.065543
C  -1.577207 -0.005719 0.053291
C  -1.87793 1.410127 -0.03475
C  -3.942812 -0.469393 0.067572
C  -2.646294 -0.959136 0.100994
C  -0.214602 -0.428179 0.085446
C  0.840382 0.497402 0.034403
C  -3.260244 1.82874 -0.057718
C  -0.780492 2.327833 -0.084628
C  -4.300989 0.895458 -0.010327
C  0.545514 1.902393 -0.050682
C  3.374202 0.713035 0.050261
C  4.617425 -0.136895 0.023811
C  5.818353 0.459287 0.488184
C  4.6496 -1.470076 -0.467022
C  7.023606 -0.271319 0.489525
C  5.858806 -2.19881 -0.469902
C  7.046652 -1.604607 0.015468
H  -2.448945 -2.032752 0.176663
H  -0.00546 -1.503612 0.150977
H  -0.954127 3.410229 -0.15254
H  -5.34377 1.221684 -0.014148
H  1.373973 2.611453 -0.080783
H  2.249557 -1.016629 0.148558
H  -2.861356 3.779599 -0.143236
H  5.780336 1.496476 0.836289
H  3.754593 -1.938697 -0.895869
H  -6.381065 -2.433411 -1.835923
H  7.943627 0.195683 0.856763
H  5.876988 -3.221842 -0.860482
H  7.983584 -2.172108 0.014015
