program: Orca
programVersion: 5.0.2
elementType: Cl Cl F F F F O O C C C C C C C C C C C C C C C H H H H H H H H H H H H
charge: 0
multiplicity: 1
keywords: wb97x-d3
keywords: def2-TZVPP
keywords: def2/J RIJCOSX
keywords: DEFGRID2
keywords: scfconv7
keywords: smallprint printgap noloewdin
keywords: NOSOSCF
formula: C15H12Cl2F4O2
InChI: InChI=1/C15H12Cl2F4O2/c1-15(2)7(3-10(16)17)11(15)14(22)23-5-6-12(20)8(18)4-9(19)13(6)21/h3-4,7,11H,5H2,1-2H3
35 atoms
Cl -3.036662 0.761905 2.414409
Cl -4.992471 1.667778 0.496582
F  4.095194 -1.432624 0.278833
F  1.371174 1.69586 -1.941383
F  2.15793 3.591876 -0.224861
F  4.917712 0.479302 1.950035
O  0.84186 -1.096427 -1.915118
O  0.796816 -1.826316 0.193706
C  -2.159438 -2.61333 -0.486773
C  -1.245448 -1.539878 -1.035579
C  -2.166104 -1.251132 0.142092
C  -1.614108 -3.758326 0.331085
C  -3.291698 -3.031219 -1.394846
C  -3.264874 -0.299646 -0.056944
C  0.213724 -1.522656 -0.818033
C  -3.698821 0.580891 0.836087
C  2.260632 -0.973913 -1.861814
C  2.71135 0.077527 -0.886714
C  3.611495 -0.199345 0.129315
C  2.23794 1.377479 -0.980134
C  2.646376 2.358219 -0.09703
C  4.034729 0.78769 1.000274
C  3.552844 2.074897 0.902267
H  -1.556759 -1.122018 -1.986182
H  -1.662313 -1.198099 1.10055
H  -2.436373 -4.251918 0.852501
H  -1.138025 -4.503038 -0.309771
H  -0.891999 -3.447571 1.081909
H  -2.979626 -3.871764 -2.017709
H  -4.154536 -3.355847 -0.809878
H  -3.620325 -2.23908 -2.066521
H  -3.765193 -0.298602 -1.01795
H  2.554857 -0.697661 -2.873611
H  2.718637 -1.937864 -1.642256
H  3.879451 2.84405 1.590385
elementType: Cl F O C H
totalener: -2049.16811901 hartree
nucrepener: 2261.38051106 hartree
electener: -4310.54863008 hartree
oneelecener: -7319.60010745 hartree
twoeener: 3009.05147738 hartree
cpcmener: -0.02126269 hartree
kineticenergy: 2043.54597263 hartree
xcener: -143.166199438123 hartree
chargesum: 0.0000000
charge: -0.055204 -0.060732 -0.204002 -0.201313 -0.202746 -0.202909 -0.281029 -0.459510 0.091644 -0.073262 0.022701 -0.267083 -0.270111 -0.198386 0.403400 0.040105 0.072543 -0.139410 0.265199 0.206808 0.190201 0.195837 -0.171981 0.093550 0.082584 0.095871 0.099400 0.094189 0.098312 0.101293 0.092306 0.127282 0.137792 0.122602 0.154062
qa: -0.0552 -0.0607 -0.2040 -0.2013 -0.2027 -0.2029 -0.2810 -0.4595 0.0916 -0.0733 0.0227 -0.2671 -0.2701 -0.1984 0.4034 0.0401 0.0725 -0.1394 0.2652 0.2068 0.1902 0.1958 -0.1720 0.0935 0.0826 0.0959 0.0994 0.0942 0.0983 0.1013 0.0923 0.1273 0.1378 0.1226 0.1541
va: 1.2706 1.2440 1.0946 1.0970 1.0867 1.0858 2.1262 2.0547 3.7338 3.8277 3.8752 3.9011 3.9116 3.8998 4.1654 4.2140 3.8366 3.5830 3.8645 3.9421 3.9626 3.9603 3.8644 1.0345 1.0461 1.0000 0.9995 1.0212 1.0010 1.0008 1.0054 1.0203 0.9906 1.0175 0.9985
dispcorr: -0.016909239 hartree
energy: -2049.185028251884
dipole: -13.23194 13.16868 -0.06325 -29.93973 29.26037 -0.67936 -11.81703 10.34890 -1.46812
magnitude: 1.61892 au
magnitude: 4.11498 debye
