program: Orca
programVersion: 5.0.2
elementType: Cl Cl F F F F O O C C C C C C C C C C C C C C C H H H H H H H H H H H H
charge: 0
multiplicity: 1
keywords: wb97x-d3
keywords: def2-TZVPP
keywords: def2/J RIJCOSX
keywords: DEFGRID2
keywords: scfconv7
keywords: smallprint printgap noloewdin
keywords: NOSOSCF
formula: C15H12Cl2F4O2
InChI: InChI=1/C15H12Cl2F4O2/c1-15(2)7(3-10(16)17)11(15)14(22)23-5-6-12(20)8(18)4-9(19)13(6)21/h3-4,7,11H,5H2,1-2H3
35 atoms
Cl -1.452069 0.256117 1.707951
Cl -4.078937 -0.446318 2.67947
F  3.546404 1.726795 -1.669325
F  1.189859 -1.706304 0.524152
F  2.184738 -0.88695 2.866244
F  4.616406 2.467783 0.661881
O  0.3459 -0.608763 -1.895728
O  0.11081 1.608055 -1.843117
C  -2.699301 -0.697014 -2.354001
C  -1.814664 0.260596 -1.568573
C  -2.316738 -1.026865 -0.951765
C  -2.144177 -1.532766 -3.481305
C  -4.095298 -0.188287 -2.622362
C  -3.275983 -0.974187 0.173499
C  -0.376867 0.504461 -1.790864
C  -2.977342 -0.459241 1.357787
C  1.762274 -0.483825 -1.952463
C  2.332221 -0.012218 -0.643249
C  3.205713 1.059749 -0.566402
C  2.011335 -0.657504 0.542535
C  2.532722 -0.242355 1.752573
C  3.753108 1.452755 0.641777
C  3.416473 0.814107 1.81495
H  -2.321311 1.165823 -1.253355
H  -1.569902 -1.809437 -0.849764
H  -2.853792 -2.323905 -3.731097
H  -1.997788 -0.929581 -4.379317
H  -1.198952 -2.012847 -3.239358
H  -4.120422 0.397147 -3.543124
H  -4.790207 -1.021953 -2.742573
H  -4.472107 0.446086 -1.819243
H  -4.258949 -1.413104 0.043058
H  2.064151 0.164731 -2.77392
H  2.124208 -1.486248 -2.178292
H  3.836205 1.131972 2.760823
elementType: Cl F O C H
totalener: -2049.16321974 hartree
nucrepener: 2362.06804687 hartree
electener: -4411.23126661 hartree
oneelecener: -7521.08343538 hartree
twoeener: 3109.85216877 hartree
cpcmener: -0.02191518 hartree
kineticenergy: 2043.55596791 hartree
xcener: -143.167592716968 hartree
chargesum: 0.0000000
charge: -0.055910 -0.057082 -0.202516 -0.197457 -0.202310 -0.202340 -0.269196 -0.451835 0.137120 -0.134679 -0.002964 -0.271262 -0.283019 -0.254727 0.389670 0.098609 0.054927 -0.103411 0.255050 0.162293 0.206857 0.194205 -0.168231 0.112513 0.111390 0.094016 0.101794 0.094176 0.100231 0.100756 0.093406 0.139569 0.124688 0.132221 0.153447
qa: -0.0559 -0.0571 -0.2025 -0.1975 -0.2023 -0.2023 -0.2692 -0.4518 0.1371 -0.1347 -0.0030 -0.2713 -0.2830 -0.2547 0.3897 0.0986 0.0549 -0.1034 0.2551 0.1623 0.2069 0.1942 -0.1682 0.1125 0.1114 0.0940 0.1018 0.0942 0.1002 0.1008 0.0934 0.1396 0.1247 0.1322 0.1534
va: 1.2834 1.2492 1.0966 1.0949 1.0861 1.0862 2.1048 2.0589 3.7167 3.8568 3.8181 3.8975 3.9178 3.9158 4.1514 4.1661 3.8528 3.5477 3.9016 3.9157 3.9516 3.9567 3.8704 1.0217 1.0230 1.0012 0.9993 1.0133 1.0024 0.9996 0.9997 1.0098 1.0159 0.9961 0.9984
dispcorr: -0.019782294 hartree
energy: -2049.183002032717
dipole: -21.64118 21.13548 -0.50570 -8.50461 6.96081 -1.54381 -30.40873 29.47167 -0.93706
magnitude: 1.87541 au
magnitude: 4.76690 debye
