program: Gaussian 09
title: 000067247
version: EM64L-G09RevD.01
frameworkgroup: C1[X(C21H28O2)]
method: RPBEPBE
basis: SDD
operation: Freq
keyword: #pfreq=noraman
keyword: PBEPBE/SDD
title: #p freq=noraman PBEPBE/SDD
converged: YES YES NO NO
title: Mulliken charges:
elementType: O O C C C C C C C C C C C C C C C C C C C C C H H H H H H H H H H H H H H H H H H H H H H H H H H H H
charge: -0.433040 -0.433600 0.165903 0.165741 0.288438 0.288267 -0.727114 0.266846 0.268636 0.013528 0.012951 -0.750925 -0.724677 -0.731293 -0.750344 -0.725234 -0.731019 -0.380740 -0.381186 -0.430758 -0.430781 -0.280188 -0.280110 0.248679 0.248659 0.218624 0.214129 0.214656 0.210142 0.202549 0.262688 0.202346 0.208825 0.269521 0.218565 0.214008 0.214597 0.209851 0.202790 0.262935 0.201973 0.208814 0.269588 0.257240 0.257314 0.249779 0.249461 0.227674 0.227528 0.373987 0.373778
chargesum: 0.00000
title: Mulliken charges with hydrogens summed into heavy atoms:
elementType: O O C C C C C C C C C C C C C C C C C C C C C
charge: -0.059053 -0.059821 0.165903 0.165741 0.288438 0.288267 -0.229776 0.266846 0.268636 0.013528 0.012951 -0.103517 -0.049298 -0.050601 -0.103174 -0.049657 -0.050644 -0.123501 -0.123872 -0.180979 -0.181320 -0.052513 -0.052582
polarizability: 2.68945868e+02 4.58187219e-01 2.06455541e+02 2.12588639e+01 5.53524376e-01 2.28187703e+02
1716.lowfreq: -13.8097 -5.5066 -0.0004 -0.0001 0.0006 7.3959 19.4842 37.3779 51.3074
frequency: 19.4717 37.1670 51.1264 70.6332 82.3564 90.0782 100.0983 168.2926 175.9692 204.2746 208.9481 226.2015 226.7688 256.7810 261.5237 267.6439 272.0383 274.2361 284.1381 304.0285 310.0452 323.5845 325.8948 328.6293 332.5505 337.9527 350.0444 388.9467 396.9121 399.9633 401.6979 476.3370 501.7725 510.4276 515.5468 528.0340 547.2292 548.6107 554.6707 565.2379 569.2293 581.3456 595.4489 645.8359 669.9330 750.0778 756.7223 777.1458 780.0884 787.4181 792.4936 833.4103 833.6634 893.3536 897.2325 916.1669 918.0254 924.2567 925.6123 934.3351 935.3134 949.1126 951.6881 953.6543 971.8569 972.6818 1020.4295 1021.9128 1032.8614 1034.1045 1083.6053 1090.2884 1134.5982 1140.1664 1173.7516 1177.4375 1178.3497 1184.9424 1186.4257 1203.2133 1203.7690 1216.1492 1217.9511 1244.6630 1253.9911 1271.5306 1272.7319 1285.6425 1291.6925 1314.2062 1369.6856 1370.3245 1374.0132 1374.2388 1385.7481 1386.3134 1399.1681 1399.3960 1422.7287 1436.3836 1454.3094 1457.6156 1457.9191 1461.7916 1463.3433 1475.9984 1476.5804 1477.3540 1478.1029 1482.4459 1482.9485 1491.6230 1492.1219 1507.0485 1508.1554 1585.8472 1590.9738 1598.5109 1605.1845 2970.7901 2971.5637 2972.4968 2975.4665 2975.9637 2979.4768 2980.0582 3024.2688 3061.2305 3061.6167 3064.6987 3065.2220 3067.9923 3069.0329 3074.1067 3074.4877 3110.2367 3111.3929 3112.9627 3113.6168 3116.5253 3117.8037 3147.9607 3148.1423 3173.1251 3174.2657 3373.9589 3392.9986
redmass: 3.9705 3.9257 3.5520 3.9986 3.3722 4.0258 4.7899 3.8560 3.4260 1.9926 1.8558 1.5274 1.4686 1.6174 1.0961 1.7374 2.7829 3.0330 2.5243 3.8435 2.8983 1.3930 1.1108 1.7246 2.9279 3.1139 3.3184 2.8338 2.6352 2.7119 2.7412 3.4095 3.2173 3.1017 3.4312 1.3386 2.9034 3.7812 3.5704 1.6476 1.9110 3.7590 5.6206 4.6653 4.9668 2.7126 2.4152 3.2565 3.0205 1.8532 2.1540 3.9604 4.0270 2.7789 2.1645 1.6652 1.5766 1.6625 1.5961 1.6758 1.6625 1.2117 1.2605 1.8620 1.3341 1.3382 1.4337 1.4419 1.3818 1.3857 2.2631 2.0931 2.2202 1.9586 1.4265 1.3493 1.9909 1.7769 1.4556 2.9276 2.9252 2.4593 2.6416 1.6923 2.0555 2.4481 2.9386 1.8930 1.5279 1.7034 1.1815 1.1807 1.2740 1.2751 3.7512 3.7999 1.2211 1.2504 2.0793 2.5585 1.2695 1.0485 1.0490 1.7983 1.8563 1.1606 1.1546 1.0791 1.0511 1.1296 1.1434 1.0528 1.0529 1.0613 1.0613 5.9152 5.9103 6.8075 6.5637 1.0354 1.0353 1.0595 1.0366 1.0367 1.0374 1.0373 1.1011 1.1001 1.1000 1.0993 1.0992 1.0997 1.0998 1.0982 1.0982 1.0979 1.0976 1.0973 1.0973 1.0883 1.0882 1.0917 1.0915 1.0955 1.0950 1.0659 1.0666
irintensity: 0.0341 0.2731 0.3790 1.1270 0.2888 0.5469 1.5385 0.0472 1.9599 0.0788 0.4739 0.1509 0.7318 0.2215 0.0658 0.1529 4.6114 0.1562 0.5739 1.6051 2.0811 0.3397 0.0942 1.4055 0.5217 11.9102 0.0572 0.8473 4.7265 0.2372 2.7714 8.6954 0.6945 3.3008 11.1982 45.1113 8.2845 1.3078 1.4817 39.4091 49.3011 1.6954 0.0018 1.9797 8.3106 23.2649 28.9300 15.8910 28.4645 33.4713 8.5929 9.2637 2.8812 4.4435 19.2669 0.0805 0.4588 1.4906 1.5625 14.6516 3.5174 0.2401 0.4049 1.4543 0.8441 1.3311 0.2332 0.2554 0.6285 0.6573 14.4223 58.8232 6.3672 34.3405 13.1199 14.7849 126.3018 2.2457 5.5903 7.5518 6.5087 5.4444 12.9133 9.3640 0.7112 8.1340 17.3730 44.1263 14.4720 18.3926 21.9915 22.3468 32.1634 1.7496 12.9522 0.9614 27.9102 14.7877 0.3028 147.5588 7.6222 0.3831 0.0026 14.2532 12.2197 7.2379 2.0852 2.4643 0.3510 4.6477 2.2593 12.1534 6.9357 23.4166 22.2239 16.6541 0.3144 1.9605 0.3532 23.3167 22.4993 22.7643 39.2048 41.4153 63.0217 43.5993 6.3777 6.6098 7.5178 14.2591 16.8455 51.7619 45.5586 91.8347 86.1879 0.7726 2.5353 21.0968 17.9086 6.1640 5.9274 16.0820 12.9423 20.9622 17.0978 15.2863 830.0045
temp: 298.150 k
press: 1.00000 atm
elementType: 8 8 6 6 6 6 6 6 6 6 6 6 6 6 6 6 6 6 6 6 6 6 6 1 1 1 1 1 1 1 1 1 1 1 1 1 1 1 1 1 1 1 1 1 1 1 1 1 1 1 1
symmnumber: 1
zpe: 1141977.4 jmol-1
zpe.correction: 0.434956 hartree
zpe.thermalcorrener: 0.458439 hartree
zpe.thermalcorrenthalpy: 0.459383 hartree
zpe.thermalcorrgfe: 0.383923 hartree
zpe.sumelectzpe: -965.760230 hartree
zpe.sumelectthermal: -965.736747 hartree
zpe.sumelectthermalent: -965.735803 hartree
zpe.sumelectthermalfe: -965.811263 hartree
dipole: 0.0154 -1.0860 0.0175
dipole: 1.0863
quadrupole: -137.6105 -135.9769 -137.0141
quadrupole: 0.1648 7.6789 0.0170
quadrupole: -0.7434 0.8903 -0.1469 0.1648 7.6789 0.0170
hfenergy: -966.1951863 hartree
pointgroup: C01 [X(C21H28O2)]
dipole: -0.0068299 0.0296106 0.4262987 debye
polarizability: 268.108782|21.9961086|228.9609238|-1.3124281|-1.3263|206.5194068 unknown
InChI: InChI=1S/C21H28O2/c1-20(2,3)16-11-7-9-14(18(16)22)13-15-10-8-12-17(19(15)23)21(4,5)6/h7-12,22-23H,13H2,1-6H3
charge 0 multiplicity 1
51 atoms
O  -1.372195 1.478087 0.138652
O  1.36974 -1.442369 0.334375
C  -3.688512 0.422619 -1.280258
C  3.694763 -0.598959 -1.200818
C  -2.95829 -0.344845 -0.150583
C  2.96805 0.316217 -0.18431
C  -0.000719 0.162633 2.339642
C  -1.150544 -0.497335 1.571661
C  1.154095 0.7076 1.492729
C  -1.818856 0.19941 0.519105
C  1.822175 -0.127117 0.545973
C  -4.898568 -0.375934 -1.835076
C  -2.706391 0.680926 -2.464511
C  -4.227375 1.781011 -0.734087
C  4.915111 0.107781 -1.8496
C  2.712117 -0.995776 -2.345662
C  4.217961 -1.880756 -0.481876
C  -3.387658 -1.627907 0.275373
C  3.404158 1.642162 0.068148
C  -1.622483 -1.779128 1.9498
C  1.631365 2.026538 1.696822
C  -2.736752 -2.347106 1.302503
C  2.752302 2.496299 0.985399
H  -0.40245 0.998838 2.945485
H  0.398255 -0.578375 3.06034
H  -5.38086 0.215183 -2.634756
H  -4.592333 -1.343194 -2.27565
H  -5.661543 -0.567909 -1.057607
H  -2.337458 -0.274092 -2.882827
H  -3.23111 1.22878 -3.270203
H  -1.841809 1.280712 -2.140056
H  -4.743316 2.329512 -1.544879
H  -4.953071 1.613819 0.083712
H  -3.407996 2.410136 -0.353053
H  5.394725 -0.589318 -2.560429
H  4.620313 1.010256 -2.416867
H  5.675913 0.393615 -1.099283
H  2.364227 -0.098221 -2.890384
H  3.228043 -1.65714 -3.067344
H  1.834348 -1.52942 -1.949267
H  4.742215 -2.528033 -1.210428
H  4.934349 -1.615073 0.317851
H  3.390341 -2.453872 -0.036055
H  -4.25298 -2.085208 -0.211022
H  4.275112 2.024568 -0.469945
H  -1.119524 -2.315016 2.764485
H  1.127927 2.669535 2.429753
H  -3.101165 -3.337124 1.595063
H  3.121142 3.514692 1.144855
H  -0.448215 1.641866 0.480038
H  0.441327 -1.555166 0.685071
