program: Orca
programVersion: 5.0.2
elementType: Cl Cl F F F F O O C C C C C C C C C C C C C C C H H H H H H H H H H H H
charge: 0
multiplicity: 1
keywords: wb97x-d3
keywords: def2-TZVPP
keywords: def2/J RIJCOSX
keywords: DEFGRID2
keywords: scfconv7
keywords: smallprint printgap noloewdin
keywords: NOSOSCF
formula: C15H12Cl2F4O2
InChI: InChI=1/C15H12Cl2F4O2/c1-15(2)7(3-10(16)17)11(15)14(22)23-5-6-12(20)8(18)4-9(19)13(6)21/h3-4,7,11H,5H2,1-2H3
35 atoms
Cl -2.877482 -2.465603 1.32449
Cl -4.7280 -0.574604 2.476359
F  4.092335 1.070054 -1.931305
F  1.104473 -1.068724 1.015904
F  2.45954 -0.088845 3.088351
F  5.477823 1.987616 0.147474
O  0.368622 -0.363004 -1.542712
O  0.590208 1.847365 -1.733541
C  -2.605567 0.332397 -2.214807
C  -1.562251 0.959802 -1.314807
C  -2.377214 -0.226433 -0.8376
C  -2.19046 -0.513568 -3.393984
C  -3.828811 1.169859 -2.497382
C  -3.330286 -0.025783 0.259679
C  -0.105864 0.878442 -1.556992
C  -3.603218 -0.907484 1.213307
C  1.769962 -0.550443 -1.698677
C  2.54573 -0.01742 -0.526391
C  3.673106 0.768118 -0.702478
C  2.169449 -0.302686 0.778334
C  2.877415 0.195443 1.855331
C  4.394495 1.245611 0.376029
C  4.002967 0.969863 1.668095
H  -1.845588 1.927706 -0.915902
H  -1.849125 -1.171855 -0.820859
H  -1.385019 -1.209035 -3.166766
H  -3.040553 -1.10506 -3.739385
H  -1.868818 0.115819 -4.226447
H  -3.672024 1.770389 -3.395306
H  -4.697498 0.532715 -2.673357
H  -4.075852 1.857874 -1.689461
H  -3.850435 0.922848 0.315854
H  2.114897 -0.108368 -2.632553
H  1.901669 -1.628924 -1.779216
H  4.562996 1.349349 2.513096
elementType: Cl F O C H
totalener: -2049.16574646 hartree
nucrepener: 2275.83589016 hartree
electener: -4325.00163662 hartree
oneelecener: -7348.26475245 hartree
twoeener: 3023.26311582 hartree
cpcmener: -0.02264003 hartree
kineticenergy: 2043.55429622 hartree
xcener: -143.168125186157 hartree
chargesum: 0.0000000
charge: -0.057486 -0.061557 -0.202671 -0.200593 -0.202211 -0.202442 -0.273465 -0.448124 0.072601 -0.087841 0.060929 -0.262341 -0.272125 -0.220143 0.407403 0.046305 0.050087 -0.112737 0.240040 0.212558 0.189759 0.197105 -0.173720 0.098707 0.078664 0.093157 0.097171 0.101184 0.097892 0.100852 0.091366 0.128832 0.126576 0.131997 0.154273
qa: -0.0575 -0.0616 -0.2027 -0.2006 -0.2022 -0.2024 -0.2735 -0.4481 0.0726 -0.0878 0.0609 -0.2623 -0.2721 -0.2201 0.4074 0.0463 0.0501 -0.1127 0.2400 0.2126 0.1898 0.1971 -0.1737 0.0987 0.0787 0.0932 0.0972 0.1012 0.0979 0.1009 0.0914 0.1288 0.1266 0.1320 0.1543
va: 1.2677 1.2432 1.0960 1.0966 1.0876 1.0864 2.1148 2.0650 3.7727 3.8258 3.7989 3.9047 3.9108 3.8985 4.1781 4.2113 3.8558 3.5706 3.9069 3.9231 3.9689 3.9594 3.8685 1.0286 1.0477 1.0142 1.0003 1.0000 1.0011 1.0005 1.0060 1.0201 1.0140 0.9948 0.9985
dispcorr: -0.017596267 hartree
energy: -2049.183342730620
dipole: -18.54914 18.24270 -0.30644 5.35353 -5.79873 -0.44520 -28.14803 27.23302 -0.91501
magnitude: 1.06271 au
magnitude: 2.70120 debye
