program: Gaussian 09
title: 000067352
version: EM64L-G09RevD.01
frameworkgroup: C1[X(C27H18O2)]
method: RPBEPBE
basis: SDD
operation: Freq
keyword: #pfreq=noraman
keyword: PBEPBE/SDD
title: #p freq=noraman PBEPBE/SDD
converged: YES YES NO NO
title: Mulliken charges:
elementType: O O C C C C C C C C C C C C C C C C C C C C C C C C C C C H H H H H H H H H H H H H H H H H H
charge: -0.401698 -0.233691 0.123788 0.210937 0.219282 0.199281 0.228285 0.235909 0.284957 0.158407 -0.384545 -0.302043 0.013775 -0.380578 -0.377071 -0.397454 -0.084782 -0.386625 -0.380658 -0.406347 -0.383881 -0.392474 -0.255715 -0.254138 -0.277105 -0.245048 -0.226637 -0.229614 -0.243031 0.264599 0.258675 0.273873 0.268607 0.257457 0.253308 0.185702 0.286343 0.268674 0.257850 0.237314 0.229955 0.235556 0.234109 0.232923 0.230531 0.232881 0.360157
chargesum: 0.00000
title: Mulliken charges with hydrogens summed into heavy atoms:
elementType: O O C C C C C C C C C C C C C C C C C C C C C C C C C C C
charge: -0.041542 -0.233691 0.123788 0.210937 0.219282 0.199281 0.228285 0.235909 0.284957 0.158407 -0.119946 -0.043369 0.013775 -0.106705 -0.108464 -0.139997 -0.084782 -0.133317 -0.194956 -0.120003 -0.115207 -0.134624 -0.018401 -0.024183 -0.041548 -0.010939 0.006287 0.000917 -0.010151
polarizability: 4.64999955e+02 3.42832759e+01 3.76210095e+02 -7.94762110e-01 3.10156180e+00 2.17849196e+02
1716.lowfreq: -2.3046 -0.0008 -0.0007 -0.0006 3.6582 7.0135 29.1320 34.6397 38.0429
frequency: 29.0341 34.5991 38.0189 44.9969 60.6403 71.9096 105.1009 125.6287 129.3848 142.0411 176.6580 189.6350 206.3211 224.1684 231.3598 271.0974 285.9706 305.0343 307.2386 315.7955 355.0513 405.7891 414.7538 422.7961 446.6626 461.2517 465.4284 473.5859 478.1105 485.5194 503.9758 524.7684 551.3853 559.3569 582.8740 602.3794 613.9816 623.0331 646.4705 663.5783 675.2459 691.7842 697.3747 703.8687 711.7946 760.5811 762.8248 772.5184 776.7605 778.5954 784.9049 799.5475 838.1219 842.1441 851.9497 856.9610 859.9971 883.8395 897.9986 934.1094 953.3774 960.7586 978.8795 983.8769 987.4772 990.3866 995.6778 999.8386 1003.5682 1005.7995 1023.4146 1026.9006 1042.6815 1048.8972 1061.3225 1076.0436 1092.2439 1131.9329 1136.1594 1158.4585 1163.6087 1172.8958 1173.8431 1181.6911 1186.2794 1192.5189 1212.6225 1251.7248 1265.9657 1286.5591 1287.5543 1297.5673 1315.0166 1326.9592 1366.1626 1370.8239 1376.3830 1387.3480 1396.4220 1405.6685 1432.4630 1445.0217 1445.7750 1449.4704 1456.2813 1474.4914 1488.1518 1521.5148 1537.9957 1556.1645 1573.6728 1575.7609 1595.1628 1599.8816 1603.9785 1614.0808 1626.2051 3090.8954 3127.0715 3129.4058 3134.0329 3137.7364 3140.1795 3144.9457 3145.6766 3147.3642 3154.6925 3158.6258 3160.1644 3163.2707 3167.8134 3172.8779 3174.0852 3176.8719 3586.0704
redmass: 5.6663 5.3535 6.9272 5.8156 5.1243 4.0213 3.5063 4.5841 4.3325 4.3707 5.2120 5.4291 5.5815 5.0224 5.6734 5.0371 1.4236 4.7764 7.0579 4.4752 5.1650 2.8656 3.2682 2.6965 4.7758 7.0634 5.0707 4.8799 4.1398 5.1942 4.1104 5.5764 5.5845 5.2365 3.7920 4.8360 5.9747 4.2963 4.0169 4.3345 3.9535 4.3991 5.1210 2.0996 3.7006 1.5324 2.9087 2.0764 2.1217 2.8147 3.4009 3.2810 3.6636 1.6001 1.9213 1.2850 1.6468 4.0022 1.5771 1.4379 1.3798 1.3947 1.3796 1.3975 5.4064 1.3549 1.3646 1.3772 3.2046 1.4256 3.6522 2.4342 2.6790 2.2037 3.2484 2.0818 1.9777 1.6857 1.5203 1.5594 1.5466 1.2409 1.1230 1.2610 1.1144 1.1209 2.0312 1.6959 1.8038 2.8263 2.1960 2.2789 1.5530 2.1347 3.6794 5.5162 6.7319 2.2864 2.4024 6.5245 2.3914 2.7351 2.9410 2.7814 2.9368 2.4410 4.4858 4.0451 7.4678 6.2590 6.0158 5.8404 6.4633 6.2175 6.2591 6.5691 6.2376 1.0880 1.0850 1.0858 1.0878 1.0863 1.0879 1.0902 1.0925 1.0893 1.0964 1.0939 1.0964 1.0974 1.1015 1.0969 1.0980 1.0954 1.0654
irintensity: 0.4489 0.3398 1.4582 0.4168 0.0520 0.2601 4.0833 2.3506 1.5189 1.6053 0.3804 1.1984 2.3366 0.3279 0.7717 3.4181 85.5014 2.7201 17.5516 4.1447 6.7826 0.8029 4.0471 28.4284 12.8129 8.5300 0.9532 2.7324 1.1618 11.9638 12.6885 1.8045 6.1974 18.4225 7.3520 9.8678 0.2364 5.3036 1.0059 0.8992 3.8226 5.0979 4.9027 26.8790 28.5128 89.1003 28.0185 51.8839 31.5460 16.1430 1.2179 2.6451 12.9479 18.9246 16.2279 1.1831 2.1538 7.8257 0.3308 1.6603 0.2611 1.8934 2.3743 0.9557 3.4407 1.1387 0.2390 1.3028 19.2088 3.7085 6.9405 10.1454 5.8561 8.4631 0.1630 7.2075 21.7541 4.8004 369.7452 9.4110 13.8046 10.4120 2.1728 16.0823 10.6122 2.6464 7.1779 11.1776 118.8084 57.7191 14.4066 18.3347 5.6161 14.6423 2.3975 4.2473 88.4782 51.9665 0.8584 19.5703 9.0193 18.2875 18.9522 19.5169 37.4355 38.9173 168.1745 75.0609 96.8952 5.1156 60.0356 28.9959 119.1617 84.3731 16.1623 30.5746 5.7745 24.1800 1.8656 3.3286 0.9752 0.6044 8.3926 6.0593 17.9660 4.5858 24.9535 22.6606 25.3144 12.0499 26.5234 13.6260 14.5084 7.2907 63.9845
temp: 298.150 k
press: 1.00000 atm
elementType: 8 8 6 6 6 6 6 6 6 6 6 6 6 6 6 6 6 6 6 6 6 6 6 6 6 6 6 6 6 1 1 1 1 1 1 1 1 1 1 1 1 1 1 1 1 1 1
symmnumber: 1
zpe: 950071.0 jmol-1
zpe.correction: 0.361863 hartree
zpe.thermalcorrener: 0.384464 hartree
zpe.thermalcorrenthalpy: 0.385408 hartree
zpe.thermalcorrgfe: 0.309514 hartree
zpe.sumelectzpe: -1188.182715 hartree
zpe.sumelectthermal: -1188.160114 hartree
zpe.sumelectthermalent: -1188.159170 hartree
zpe.sumelectthermalfe: -1188.235064 hartree
dipole: 4.3333 3.8771 3.1862
dipole: 6.6303
quadrupole: -157.8713 -166.1142 -166.1271
quadrupole: -28.5814 -3.7095 -9.5391
quadrupole: 5.4996 -2.7433 -2.7562 -28.5814 -3.7095 -9.5391
hfenergy: -1188.5445781 hartree
pointgroup: C01 [X(C27H18O2)]
dipole: 1.5919275 -1.9151864 -0.7761942 debye
polarizability: 461.396018|-38.4336507|368.1724513|4.9874847|-41.7202449|229.4907763 unknown
InChI: InChI=1S/C27H18O2/c28-25-16-14-23(19-10-4-6-12-21(19)25)27(18-8-2-1-3-9-18)24-15-17-26(29)22-13-7-5-11-20(22)24/h1-17,28H
charge 0 multiplicity 1
47 atoms
O  5.699562 -0.078753 0.909692
O  -3.288665 4.048259 0.565868
C  -0.013612 -0.524916 0.4065
C  1.470334 -0.388301 0.444303
C  -0.855714 0.599307 0.240842
C  2.229771 0.305914 -0.585355
C  -2.258481 0.558913 -0.248738
C  -0.534579 -1.895595 0.671768
C  3.672698 0.421163 -0.460597
C  -3.080642 1.731308 -0.141747
C  2.179471 -0.985936 1.508171
C  -0.33254 1.907935 0.624566
C  4.320439 -0.164174 0.689052
C  1.620043 0.842423 -1.769454
C  -2.806286 -0.566721 -0.936609
C  3.58281 -0.868778 1.646028
C  -2.546575 3.015566 0.407024
C  -1.116393 3.034456 0.728877
C  4.417989 1.091339 -1.486939
C  -4.417019 1.723322 -0.621375
C  -1.616878 -2.097618 1.57748
C  0.084102 -3.039192 0.090245
C  2.371497 1.482444 -2.756388
C  -4.125523 -0.557801 -1.420503
C  3.785099 1.62131 -2.611616
C  -4.950516 0.583967 -1.24429
C  -2.076395 -3.395957 1.87251
C  -0.38763 -4.338374 0.373481
C  -1.469955 -4.522926 1.265758
H  1.619212 -1.530692 2.274623
H  0.715261 1.95834 0.937648
H  0.539858 0.738484 -1.899472
H  -2.190141 -1.453155 -1.103664
H  4.106925 -1.308734 2.498588
H  -0.708493 3.979359 1.103285
H  5.510135 1.189943 -1.415927
H  -4.998383 2.643755 -0.501963
H  -2.083095 -1.228196 2.052601
H  0.927221 -2.900324 -0.595483
H  1.875215 1.878433 -3.648479
H  -4.513994 -1.439187 -1.942921
H  4.369076 2.128969 -3.38625
H  -5.98192 0.582696 -1.613027
H  -2.902935 -3.531973 2.578516
H  0.089782 -5.205157 -0.096686
H  -1.831145 -5.532084 1.492996
H  6.154506 0.455039 0.212761
