program: Orca
programVersion: 5.0.2
elementType: Br Br Br Br O O O N C C C C C C C C C C C C C C C C C C C C C C H H H H H H H H H H H H H H H H H H H
charge: 0
multiplicity: 1
keywords: wb97x-d3
keywords: def2-TZVPP
keywords: def2/J RIJCOSX
keywords: DEFGRID2
keywords: scfconv7
keywords: smallprint printgap noloewdin
keywords: NOSOSCF
formula: C22H19Br4NO3
InChI: InChI=1/C22H19Br4NO3/c1-21(2)17(19(23)22(24,25)26)18(21)20(28)30-16(12-27)13-7-6-10-15(11-13)29-14-8-4-3-5-9-14/h3-11,16-19H,1-2H3
49 atoms
Br 3.477394 -1.661014 -1.510196
Br 3.186791 1.029935 0.638723
Br 1.463726 -0.73249 2.575079
Br 4.348571 -1.656981 1.807654
O  -2.554972 -1.193707 0.796624
O  -1.518049 0.598405 -0.051379
O  -5.525325 2.823507 -2.214148
N  -5.250805 -1.869625 2.559251
C  -0.013177 -1.850472 -1.494648
C  0.879838 -1.048277 -0.598117
C  -0.438531 -1.542975 -0.068305
C  2.167221 -1.58917 -0.049292
C  0.267222 -3.304779 -1.785443
C  -0.655202 -1.131597 -2.655029
C  -1.516433 -0.577639 0.210533
C  2.756628 -0.789197 1.125006
C  -3.726222 -0.41187 1.017016
C  -4.439107 -0.087012 -0.274046
C  -4.570874 -1.240182 1.878103
C  -4.655551 1.239704 -0.612023
C  -4.840068 -1.112658 -1.122567
C  -5.25959 1.539633 -1.826225
C  -5.460836 -0.797018 -2.320196
C  -5.664598 0.526479 -2.682597
C  -4.639217 3.837114 -1.943628
C  -3.261074 3.66155 -1.986946
C  -5.187654 5.085168 -1.683534
C  -2.435373 4.752312 -1.752258
C  -4.348759 6.168126 -1.464726
C  -2.970269 6.006779 -1.491112
H  0.907308 0.008488 -0.84439
H  -0.425942 -2.405945 0.588341
H  2.044545 -2.620134 0.293818
H  0.95473 -3.407366 -2.625384
H  0.683011 -3.843885 -0.934439
H  -0.662187 -3.806974 -2.058457
H  -1.625012 -1.572812 -2.891484
H  -0.800777 -0.068134 -2.475846
H  -0.023136 -1.229091 -3.538781
H  -3.491888 0.504279 1.568842
H  -4.345345 2.025758 0.065302
H  -4.673834 -2.148727 -0.854442
H  -5.781185 -1.586608 -2.986154
H  -6.138289 0.772552 -3.624256
H  -2.825446 2.693191 -2.199377
H  -6.26313 5.20694 -1.658762
H  -1.362325 4.615547 -1.781618
H  -4.779381 7.14055 -1.265126
H  -2.318171 6.851038 -1.312388
elementType: Br O N C H
nucrepener: 5566.17087346 hartree
twoeener: 9969.47461435 hartree
cpcmener: -0.03607346 hartree
xcener: -389.797655685860 hartree
chargesum: -0.0000000
charge: -0.083501 -0.013768 -0.012558 -0.003029 -0.266369 -0.450812 -0.336474 -0.100080 0.100023 -0.089953 -0.151046 -0.156206 -0.266836 -0.254936 0.397579 0.036594 0.417740 0.031045 -0.219107 -0.211185 -0.249297 0.295363 -0.118874 -0.230946 0.300956 -0.198298 -0.258890 -0.151671 -0.121996 -0.189849 0.117373 0.123564 0.169596 0.098630 0.094633 0.109599 0.102321 0.089438 0.102734 0.142159 0.150669 0.148330 0.163159 0.151302 0.161426 0.148005 0.160907 0.161449 0.161086
qa: -0.0835 -0.0138 -0.0126 -0.0030 -0.2664 -0.4508 -0.3365 -0.1001 0.1000 -0.0900 -0.1510 -0.1562 -0.2668 -0.2549 0.3976 0.0366 0.4177 0.0310 -0.2191 -0.2112 -0.2493 0.2954 -0.1189 -0.2309 0.3010 -0.1983 -0.2589 -0.1517 -0.1220 -0.1898 0.1174 0.1236 0.1696 0.0986 0.0946 0.1096 0.1023 0.0894 0.1027 0.1422 0.1507 0.1483 0.1632 0.1513 0.1614 0.1480 0.1609 0.1614 0.1611
va: 1.1811 1.2213 1.2245 1.2291 2.1387 2.0569 2.0754 3.1100 3.8771 3.7434 3.8578 4.0583 3.8957 3.9010 4.1711 4.3508 3.7179 3.5517 4.0805 3.9436 3.9689 3.7070 3.8943 4.0181 3.6747 3.8980 4.0049 3.8949 3.8766 3.9036 1.0427 1.0223 0.9932 1.0055 1.0037 1.0023 1.0010 1.0143 1.0041 1.0154 1.0057 1.0108 0.9878 1.0041 0.9936 1.0079 0.9902 0.9877 0.9893
dispcorr: -0.030373636 hartree
energy: -11427.159753728743
dipole: -153.49216 153.88938 0.39722 34.27853 -34.66344 -0.38491 -59.23720 57.87364 -1.36356
magnitude: 1.47147 au
magnitude: 3.74018 debye
