program: Orca
programVersion: 5.0.2
elementType: Br Br Br Br O O O N C C C C C C C C C C C C C C C C C C C C C C H H H H H H H H H H H H H H H H H H H
charge: 0
multiplicity: 1
keywords: wb97x-d3
keywords: def2-TZVPP
keywords: def2/J RIJCOSX
keywords: DEFGRID2
keywords: scfconv7
keywords: smallprint printgap noloewdin
keywords: NOSOSCF
formula: C22H19Br4NO3
InChI: InChI=1/C22H19Br4NO3/c1-21(2)17(19(23)22(24,25)26)18(21)20(28)30-16(12-27)13-7-6-10-15(11-13)29-14-8-4-3-5-9-14/h3-11,16-19H,1-2H3
49 atoms
Br 4.172889 -2.275065 1.314053
Br 1.764794 -4.205891 -0.220164
Br 0.871601 -1.712995 -1.911178
Br 3.821774 -2.737808 -2.08278
O  -1.363232 0.915362 0.424624
O  -1.348797 -1.011365 1.552585
O  -5.328274 4.964603 1.045117
N  -3.702033 -1.051361 -1.038572
C  1.632038 -0.038143 2.157874
C  1.578221 -1.18266 1.198104
C  0.720982 0.031865 0.941815
C  2.702013 -1.512132 0.261261
C  2.789717 0.930331 2.146371
C  1.065739 -0.259011 3.537684
C  -0.741323 -0.109715 1.031034
C  2.328546 -2.478746 -0.876394
C  -2.786045 0.905853 0.439884
C  -3.274562 2.221491 -0.107755
C  -3.28308 -0.203709 -0.383179
C  -4.045656 3.038047 0.704101
C  -2.95694 2.611767 -1.404154
C  -4.519063 4.247405 0.210773
C  -3.431228 3.823367 -1.87932
C  -4.21788 4.645813 -1.084089
C  -5.347844 6.337806 0.996609
C  -6.58682 6.952076 1.102659
C  -4.182885 7.090704 0.918499
C  -6.659467 8.337582 1.136434
C  -4.272542 8.475125 0.939999
C  -5.505811 9.104365 1.049497
H  1.041956 -2.045649 1.580451
H  1.058494 0.726206 0.180563
H  3.102465 -0.606409 -0.202021
H  3.598216 0.570352 2.782974
H  3.194396 1.107573 1.150311
H  2.465527 1.895023 2.539067
H  1.853122 -0.627904 4.196691
H  0.696652 0.678337 3.956243
H  0.255699 -0.984885 3.559583
H  -3.164939 0.759805 1.455547
H  -4.288802 2.735863 1.715595
H  -2.355562 1.977174 -2.043193
H  -3.198354 4.133214 -2.889086
H  -4.592738 5.579496 -1.482703
H  -7.484473 6.350407 1.166824
H  -3.214651 6.611372 0.847716
H  -7.625784 8.816438 1.224793
H  -3.366605 9.063628 0.878955
H  -5.566063 10.184178 1.070532
elementType: Br O N C H
nucrepener: 5384.31929682 hartree
twoeener: 9788.42672001 hartree
cpcmener: -0.03939766 hartree
xcener: -389.797490367847 hartree
chargesum: -0.0000000
charge: -0.082435 -0.014209 -0.013581 -0.002599 -0.272630 -0.454108 -0.334959 -0.099839 0.096512 -0.091935 -0.143036 -0.152643 -0.263739 -0.260981 0.401731 0.039222 0.447701 -0.000306 -0.235914 -0.214396 -0.221937 0.263801 -0.152082 -0.173168 0.289082 -0.252236 -0.197167 -0.123989 -0.145123 -0.187028 0.117245 0.122091 0.168882 0.098728 0.094203 0.109976 0.100522 0.105322 0.093886 0.130467 0.139790 0.151976 0.163626 0.159806 0.148688 0.160804 0.161366 0.162773 0.161840
qa: -0.0824 -0.0142 -0.0136 -0.0026 -0.2726 -0.4541 -0.3350 -0.0998 0.0965 -0.0919 -0.1430 -0.1526 -0.2637 -0.2610 0.4017 0.0392 0.4477 -0.0003 -0.2359 -0.2144 -0.2219 0.2638 -0.1521 -0.1732 0.2891 -0.2522 -0.1972 -0.1240 -0.1451 -0.1870 0.1172 0.1221 0.1689 0.0987 0.0942 0.1100 0.1005 0.1053 0.0939 0.1305 0.1398 0.1520 0.1636 0.1598 0.1487 0.1608 0.1614 0.1628 0.1618
va: 1.1823 1.2209 1.2287 1.2293 2.1645 2.0470 2.0671 3.1083 3.8621 3.7340 3.8997 4.0602 3.9020 3.9005 4.1437 4.3503 3.6819 3.7352 4.0238 4.0377 3.9845 3.7726 3.9290 3.9128 3.6677 4.0097 3.9152 3.8796 3.8825 3.8983 1.0466 1.0217 0.9934 1.0055 1.0036 1.0026 1.0020 0.9999 1.0165 1.0212 1.0164 1.0076 0.9902 0.9944 1.0073 0.9952 0.9881 0.9890 0.9893
dispcorr: -0.028106553 hartree
energy: -11427.159328755828
dipole: -123.20904 124.18819 0.97915 155.07182 -151.31352 3.75830 46.75063 -45.98571 0.76492
magnitude: 3.95837 au
magnitude: 10.06137 debye
