program: Orca
programVersion: 5.0.2
elementType: Br Br Br Br O O O N C C C C C C C C C C C C C C C C C C C C C C H H H H H H H H H H H H H H H H H H H
charge: 0
multiplicity: 1
keywords: wb97x-d3
keywords: def2-TZVPP
keywords: def2/J RIJCOSX
keywords: DEFGRID2
keywords: scfconv7
keywords: smallprint printgap noloewdin
keywords: NOSOSCF
formula: C22H19Br4NO3
InChI: InChI=1/C22H19Br4NO3/c1-21(2)17(19(23)22(24,25)26)18(21)20(28)30-16(12-27)13-7-6-10-15(11-13)29-14-8-4-3-5-9-14/h3-11,16-19H,1-2H3
49 atoms
Br 2.835675 -3.841426 1.785191
Br 3.175286 -2.892864 -1.530168
Br 2.829018 0.104574 -0.662547
Br 5.127392 -1.616254 0.574452
O  -1.417356 0.745299 0.087723
O  -1.128939 -1.094945 -1.142612
O  -6.374804 3.629669 0.230852
N  -1.067157 1.838665 -3.094623
C  -0.197421 -2.091151 1.779688
C  0.891427 -2.080213 0.753868
C  0.042224 -0.850497 0.935018
C  2.346548 -2.061221 1.116959
C  0.120373 -1.939636 3.247464
C  -1.389723 -2.976388 1.519813
C  -0.871957 -0.458561 -0.151704
C  3.290513 -1.676291 -0.034011
C  -2.332872 1.240138 -0.881925
C  -2.995038 2.474536 -0.326616
C  -1.611962 1.560856 -2.12014
C  -4.379136 2.535467 -0.30566
C  -2.232685 3.540676 0.13912
C  -5.010191 3.667507 0.196108
C  -2.876489 4.658513 0.642864
C  -4.26277 4.731946 0.680712
C  -7.109469 4.790263 0.160498
C  -8.154285 4.935203 1.060676
C  -6.869301 5.749794 -0.81508
C  -8.972194 6.05412 0.979582
C  -7.687351 6.868642 -0.876326
C  -8.739882 7.02628 0.0167
H  0.6608 -2.665209 -0.130815
H  0.464361 -0.018436 1.487397
H  2.53825 -1.367328 1.939487
H  0.96193 -1.274346 3.438314
H  -0.742748 -1.525191 3.770079
H  0.343813 -2.908159 3.695465
H  -1.591958 -3.125522 0.460943
H  -1.216047 -3.959075 1.960713
H  -2.285182 -2.55936 1.982956
H  -3.089682 0.489442 -1.125798
H  -4.97206 1.706786 -0.673547
H  -1.151009 3.504323 0.111605
H  -2.295176 5.489973 1.017956
H  -4.742318 5.612086 1.088539
H  -8.331021 4.175698 1.811595
H  -6.059632 5.629148 -1.523798
H  -9.790904 6.165248 1.678313
H  -7.501792 7.617793 -1.634683
H  -9.376014 7.899254 -0.041024
elementType: Br O N C H
nucrepener: 5353.31185796 hartree
twoeener: 9757.57093200 hartree
cpcmener: -0.03910148 hartree
xcener: -389.797545069841 hartree
chargesum: -0.0000000
charge: -0.083295 -0.013108 -0.014346 -0.002059 -0.274423 -0.452050 -0.334406 -0.101873 0.099192 -0.097530 -0.146849 -0.148484 -0.264740 -0.258912 0.406667 0.036946 0.437914 0.000461 -0.229408 -0.215253 -0.222240 0.263779 -0.153842 -0.172355 0.277869 -0.242195 -0.193052 -0.128282 -0.145278 -0.181975 0.114369 0.124030 0.169145 0.094580 0.109391 0.099157 0.093551 0.100634 0.106075 0.130928 0.140369 0.151856 0.164375 0.159087 0.148652 0.161448 0.161235 0.162456 0.161788
qa: -0.0833 -0.0131 -0.0143 -0.0021 -0.2744 -0.4521 -0.3344 -0.1019 0.0992 -0.0975 -0.1468 -0.1485 -0.2647 -0.2589 0.4067 0.0369 0.4379 0.0005 -0.2294 -0.2153 -0.2222 0.2638 -0.1538 -0.1724 0.2779 -0.2422 -0.1931 -0.1283 -0.1453 -0.1820 0.1144 0.1240 0.1691 0.0946 0.1094 0.0992 0.0936 0.1006 0.1061 0.1309 0.1404 0.1519 0.1644 0.1591 0.1487 0.1614 0.1612 0.1625 0.1618
va: 1.1819 1.2218 1.2261 1.2307 2.1657 2.0516 2.0668 3.1100 3.8701 3.7451 3.8863 4.0550 3.9002 3.9012 4.1566 4.3545 3.6904 3.7480 4.0239 4.0408 3.9813 3.7732 3.9291 3.9034 3.6737 4.0076 3.9212 3.8792 3.8836 3.8946 1.0483 1.0190 0.9939 1.0034 1.0028 1.0055 1.0155 1.0022 0.9999 1.0232 1.0168 1.0098 0.9900 0.9953 1.0066 0.9947 0.9882 0.9892 0.9891
dispcorr: -0.028006898 hartree
energy: -11427.158913017958
dipole: -182.35079 180.60464 -1.74615 103.64838 -102.42115 1.22723 18.53860 -15.55098 2.98761
magnitude: 3.67164 au
magnitude: 9.33258 debye
